Jump to content

[AMD] xnu-2782.1.97 build help….


6 posts in this topic

Recommended Posts

My System Current Configuration:

 

OS : OS X 10.10 Yosemite

 

AvailabilityVersions-9 & dtrace-147 Build with Xcode 5.0.2

 

Xcode: Xcode 6.1

Command Line Tools: command_line_tools_for_osx_10.10_for_xcode_6.1.dmg

 

MakeInc.cmd fixed

 

SDKROOT ?= macosx.internaln  Replace to   SDKROOT ?= /

 

build cmd: make ARCH_CONFIGS=X86_64 KERNEL_CONFIGS=RELEASE SDKROOT=macosx

 

Result:

 

 

 

Last login: Tue Nov 11 16:24:01 on ttys000
djpvddeMac-Pro:~ djpvd$ cd /Volumes/DATA1/xnu-2782.1.97
djpvddeMac-Pro:xnu-2782.1.97 djpvd$ make ARCH_CONFIGS=X86_64 KERNEL_CONFIGS=RELEASE SDKROOT=macosx
HOST_CC setsegname.o
HOST_CC externs.o
HOST_CC kextsymboltool.o
HOST_BISON parser.c
HOST_CC openp.o
HOST_LD setsegname
Stack dump:
0.	Program arguments: /Volumes/MacAPP/Applications/Xcode6/Xcode.app/Contents/Developer/Toolchains/XcodeDefault.xctoolchain/usr/bin/clang -cc1 -triple x86_64-apple-macosx10.10.0 -emit-obj -mrelax-all -disable-free -disable-llvm-verifier -main-file-name openp.c -mrelocation-model pic -pic-level 2 -mdisable-fp-elim -masm-verbose -munwind-tables -target-cpu core2 -target-linker-version 241.9 -gdwarf-2 -coverage-file /Volumes/DATA1/xnu-2782.1.97/BUILD/obj/SETUP/config/openp.o -resource-dir /Volumes/MacAPP/Applications/Xcode6/Xcode.app/Contents/Developer/Toolchains/XcodeDefault.xctoolchain/usr/bin/../lib/clang/6.0 -isysroot /Volumes/MacAPP/Applications/Xcode6/Xcode.app/Contents/Developer/Platforms/MacOSX.platform/Developer/SDKs/MacOSX10.10.sdk -D YY_NO_INPUT -I /Volumes/DATA1/xnu-2782.1.97/SETUP/config/ -I . -O0 -Wall -fdebug-compilation-dir /Volumes/DATA1/xnu-2782.1.97/BUILD/obj/SETUP/config -ferror-limit 19 -fmessage-length 80 -stack-protector 1 -mstackrealign -fblocks -fobjc-runtime=macosx-10.10.0 -fencode-extended-block-signature -fdiagnostics-show-option -fcolor-diagnostics -vectorize-slp -o openp.o -x c /Volumes/DATA1/xnu-2782.1.97/SETUP/config/openp.c 
1.	<eof> parser at end of file
2.	Code generation
3.	Running pass 'Function Pass Manager' on module '/Volumes/DATA1/xnu-2782.1.97/SETUP/config/openp.c'.
4.	Running pass 'X86 DAG->DAG Instruction Selection' on function '@openp'
HOST_LD kextsymboltool
ld: warning: directory not found for option '-L//usr/local/lib/system'
HOST_CODESIGN setsegname
HOST_CODESIGN kextsymboltool
HOST_CC decomment.o
HOST_CC installfile.o
Stack dump:
0.	Program arguments: /Volumes/MacAPP/Applications/Xcode6/Xcode.app/Contents/Developer/Toolchains/XcodeDefault.xctoolchain/usr/bin/clang -cc1 -triple x86_64-apple-macosx10.10.0 -emit-obj -mrelax-all -disable-free -disable-llvm-verifier -main-file-name decomment.c -mrelocation-model pic -pic-level 2 -mdisable-fp-elim -masm-verbose -munwind-tables -target-cpu core2 -target-linker-version 241.9 -gdwarf-2 -coverage-file /Volumes/DATA1/xnu-2782.1.97/BUILD/obj/SETUP/decomment/decomment.o -resource-dir /Volumes/MacAPP/Applications/Xcode6/Xcode.app/Contents/Developer/Toolchains/XcodeDefault.xctoolchain/usr/bin/../lib/clang/6.0 -isysroot /Volumes/MacAPP/Applications/Xcode6/Xcode.app/Contents/Developer/Platforms/MacOSX.platform/Developer/SDKs/MacOSX10.10.sdk -I /Volumes/DATA1/xnu-2782.1.97/SETUP/decomment/ -I . -O0 -Wall -fdebug-compilation-dir /Volumes/DATA1/xnu-2782.1.97/BUILD/obj/SETUP/decomment -ferror-limit 19 -fmessage-length 80 -stack-protector 1 -mstackrealign -fblocks -fobjc-runtime=macosx-10.10.0 -fencode-extended-block-signature -fdiagnostics-show-option -fcolor-diagnostics -vectorize-slp -o decomment.o -x c /Volumes/DATA1/xnu-2782.1.97/SETUP/decomment/decomment.c 
1.	<eof> parser at end of file
2.	Code generation
3.	Running pass 'Function Pass Manager' on module '/Volumes/DATA1/xnu-2782.1.97/SETUP/decomment/decomment.c'.
4.	Running pass 'X86 DAG->DAG Instruction Selection' on function '@main'
HOST_LD installfile
HOST_CODESIGN installfile
HOST_CC searchp.o
Stack dump:
0.	Program arguments: /Volumes/MacAPP/Applications/Xcode6/Xcode.app/Contents/Developer/Toolchains/XcodeDefault.xctoolchain/usr/bin/clang -cc1 -triple x86_64-apple-macosx10.10.0 -emit-obj -mrelax-all -disable-free -disable-llvm-verifier -main-file-name searchp.c -mrelocation-model pic -pic-level 2 -mdisable-fp-elim -masm-verbose -munwind-tables -target-cpu core2 -target-linker-version 241.9 -gdwarf-2 -coverage-file /Volumes/DATA1/xnu-2782.1.97/BUILD/obj/SETUP/config/searchp.o -resource-dir /Volumes/MacAPP/Applications/Xcode6/Xcode.app/Contents/Developer/Toolchains/XcodeDefault.xctoolchain/usr/bin/../lib/clang/6.0 -isysroot /Volumes/MacAPP/Applications/Xcode6/Xcode.app/Contents/Developer/Platforms/MacOSX.platform/Developer/SDKs/MacOSX10.10.sdk -D YY_NO_INPUT -I /Volumes/DATA1/xnu-2782.1.97/SETUP/config/ -I . -O0 -Wall -fdebug-compilation-dir /Volumes/DATA1/xnu-2782.1.97/BUILD/obj/SETUP/config -ferror-limit 19 -fmessage-length 80 -stack-protector 1 -mstackrealign -fblocks -fobjc-runtime=macosx-10.10.0 -fencode-extended-block-signature -fdiagnostics-show-option -fcolor-diagnostics -vectorize-slp -o searchp.o -x c /Volumes/DATA1/xnu-2782.1.97/SETUP/config/searchp.c 
1.	<eof> parser at end of file
2.	Code generation
3.	Running pass 'Function Pass Manager' on module '/Volumes/DATA1/xnu-2782.1.97/SETUP/config/searchp.c'.
4.	Running pass 'X86 DAG->DAG Instruction Selection' on function '@searchp'
clang: error: unable to execute command: Segmentation fault: 11
clang: error: clang frontend command failed due to signal (use -v to see invocation)
Apple LLVM version 6.0 (clang-600.0.54) (based on LLVM 3.5svn)
Target: x86_64-apple-darwin14.0.0
Thread model: posix
clang: note: diagnostic msg: PLEASE submit a bug report to http://developer.apple.com/bugreporter/ and include the crash backtrace, preprocessed source, and associated run script.
clang: error: unable to execute command: Segmentation fault: 11
clang: error: clang frontend command failed due to signal (use -v to see invocation)
Apple LLVM version 6.0 (clang-600.0.54) (based on LLVM 3.5svn)
Target: x86_64-apple-darwin14.0.0
Thread model: posix
clang: note: diagnostic msg: PLEASE submit a bug report to http://developer.apple.com/bugreporter/ and include the crash backtrace, preprocessed source, and associated run script.
clang: note: diagnostic msg: 
********************

PLEASE ATTACH THE FOLLOWING FILES TO THE BUG REPORT:
Preprocessed source(s) and associated run script(s) are located at:
clang: note: diagnostic msg: /var/folders/d8/r_8svvjd48d93d00bb1pkv_w0000gn/T/openp-0dfb5c.c
clang: note: diagnostic msg: /var/folders/d8/r_8svvjd48d93d00bb1pkv_w0000gn/T/openp-0dfb5c.sh
clang: note: diagnostic msg: 

********************
make[5]: *** [openp.o] Error 254
make[5]: *** Waiting for unfinished jobs....
HOST_CC replacecontents.o
HOST_LD replacecontents
HOST_CODESIGN replacecontents
clang: error: unable to execute command: Segmentation fault: 11
clang: error: clang frontend command failed due to signal (use -v to see invocation)
Apple LLVM version 6.0 (clang-600.0.54) (based on LLVM 3.5svn)
Target: x86_64-apple-darwin14.0.0
Thread model: posix
clang: note: diagnostic msg: PLEASE submit a bug report to http://developer.apple.com/bugreporter/ and include the crash backtrace, preprocessed source, and associated run script.
clang: note: diagnostic msg: 
********************

PLEASE ATTACH THE FOLLOWING FILES TO THE BUG REPORT:
Preprocessed source(s) and associated run script(s) are located at:
clang: note: diagnostic msg: /var/folders/d8/r_8svvjd48d93d00bb1pkv_w0000gn/T/decomment-edf09f.c
clang: note: diagnostic msg: /var/folders/d8/r_8svvjd48d93d00bb1pkv_w0000gn/T/decomment-edf09f.sh
clang: note: diagnostic msg: 

********************
make[5]: *** [decomment.o] Error 254
make[4]: *** [build_setup] Error 2
make[3]: *** [build_setup_recurse_into_decomment] Error 2
make[3]: *** Waiting for unfinished jobs....
clang: note: diagnostic msg: 
********************

PLEASE ATTACH THE FOLLOWING FILES TO THE BUG REPORT:
Preprocessed source(s) and associated run script(s) are located at:
clang: note: diagnostic msg: /var/folders/d8/r_8svvjd48d93d00bb1pkv_w0000gn/T/searchp-ca046c.c
clang: note: diagnostic msg: /var/folders/d8/r_8svvjd48d93d00bb1pkv_w0000gn/T/searchp-ca046c.sh
clang: note: diagnostic msg: 

********************
make[5]: *** [searchp.o] Error 254
make[4]: *** [build_setup] Error 2
make[3]: *** [build_setup_recurse_into_config] Error 2
make[2]: *** [build_setup_recurse_into_SETUP] Error 2
make[1]: *** [build_setup_bootstrap_RELEASE^X86_64^NONE] Error 2
make: *** [all] Error 2

djpvddeMac-Pro:xnu-2782.1.97 djpvd$ cc --version
Apple LLVM version 6.0 (clang-600.0.54) (based on LLVM 3.5svn)
Target: x86_64-apple-darwin14.0.0
Thread model: posix

 

 

How to fix this problem…. Help… thank

  • Like 1

Hey djpvd

 

I just want to clear up a few things.

 

Are you building the kernel on an AMD machine or Intel?

 

By the way, you don't need to edit MakeInc.cmd if you compile with

 

SDKROOT=macosx
To be easier compile adding this to the end

1> success.txt 2> error.txt
EXAMPLE

make SDKROOT=macosx ARCH_CONFIGS=X86_64 KERNEL_CONFIGS=RELEASE 1> ../success.txt 2> ../error.txt
That way you only have to send what's in the error.txt file as this breaks it down into two files for success and errors
  • Like 1

Here is my current attempt to create Yosemite kernel, for ideas, I am very grateful

 

 


Last login: Tue Nov 18 14:21:18 on ttys000
georges-imac:~ mein$ cd /Users/Shared/BSA_10.10.1_rc1
georges-imac:BSA_10.10.1_rc1 mein$ make SDKROOT=macosx ARCH_CONFIGS=X86_64 KERNEL_CONFIGS=RELEASE - install
HOST_CC kextsymboltool.o
HOST_CC setsegname.o
HOST_CC installfile.o
HOST_CC externs.o
HOST_CC decomment.o
HOST_BISON parser.c
HOST_LD installfile
HOST_LD decomment
HOST_LD setsegname
HOST_CC openp.o
HOST_LD kextsymboltool
HOST_CC searchp.o
HOST_FLEX lexer.yy.c
HOST_CC parser.o
HOST_CC main.o
HOST_CC mkheaders.o
HOST_CC mkioconf.o
HOST_CC mkmakefile.o
HOST_CODESIGN setsegname
HOST_CODESIGN decomment
HOST_CODESIGN installfile
HOST_CC lexer.yy.o
HOST_CODESIGN kextsymboltool
HOST_LD config
HOST_CODESIGN config
HOST_CC replacecontents.o
HOST_LD replacecontents
HOST_CODESIGN replacecontents
INSTALL darwin.d
INSTALL errno.d
INSTALL io.d
INSTALL ip.d
INSTALL regs_x86_64.d
INSTALL sched.d
INSTALL signal.d
INSTALL socket.d
INSTALL tcp.d
INSTALL unistd.d
INSTALL trace.codes
MAN _exit.2
MAN EV_SET.2
MAN FD_CLR.2
MAN FD_COPY.2
MAN FD_ISSET.2
MAN FD_SET.2
MAN FD_ZERO.2
MAN aio_cancel.2
MAN aio_error.2
MAN aio_read.2
MAN aio_return.2
MAN aio_suspend.2
MAN aio_write.2
MAN accept.2
MAN access.2
MAN acct.2
MAN adjtime.2
MAN audit.2
MAN auditctl.2
MAN auditon.2
MAN bind.2
MAN chdir.2
INSTALLHDR endian.h
MIG clock.h
MAN chflags.2
MAN chmod.2
MAN chown.2
MAN chroot.2
MAN close.2
MAN connect.2
INSTALLHDR fasttrap_isa.h
MAN dup.2
MAN dup2.2
MAN execve.2
MAN exchangedata.2
INSTALLHDR param.h
MAN faccessat.2
MAN fchdir.2
MAN fchflags.2
INSTALLHDR profile.h
MAN fchmod.2
MAN fchmodat.2
MAN fchown.2
INSTALLHDR signal.h
MAN fchownat.2
MAN fcntl.2
MAN fgetattrlist.2
MAN fsetattrlist.2
INSTALLHDR limits.h
MAN fgetxattr.2
MAN fhopen.2
MAN flistxattr.2
MAN flock.2
MAN fork.2
INSTALLHDR _limits.h
MAN fpathconf.2
MIG clock_priv.h
MAN fremovexattr.2
MAN fsetxattr.2
INSTALLHDR types.h
MAN fstat.2
MAN fstat64.2
MAN fstatat.2
INSTALLHDR vmparam.h
MAN fstatfs.2
MAN fstatfs64.2
MAN fsync.2
INSTALLHDR _types.h
MAN ftruncate.2
MAN futimes.2
MAN getattrlist.2
MAN getattrlistat.2
INSTALLHDR _param.h
MAN getattrlistbulk.2
MIG host_priv.h
MAN getaudit.2
MAN getaudit_addr.2
MAN getauid.2
MAN getdirentries.2
MAN getdirentriesattr.2
MAN getdtablesize.2
INSTALLHDR _mcontext.h
MAN getegid.2
MAN geteuid.2
MAN getfh.2
MAN getfsstat.2
INSTALLHDR endian.h
MAN getgid.2
MAN getgroups.2
MIG host_security.h
MAN getitimer.2
INSTALLHDR param.h
MAN getlcid.2
MAN getlogin.2
MAN getpeername.2
MAN getpgrp.2
INSTALLHDR profile.h
MAN getpgid.2
MAN getpid.2
MAN getppid.2
MIG lock_set.h
MAN getpriority.2
INSTALLHDR signal.h
MAN getrlimit.2
MAN getrusage.2
MAN getsid.2
MAN getsockname.2
INSTALLHDR limits.h
MAN getsockopt.2
MAN gettimeofday.2
MAN getuid.2
INSTALLHDR _limits.h
MAN getxattr.2
MAN i386_get_ldt.2
MIG mach_host.h
MAN i386_set_ldt.2
INSTALLHDR types.h
MAN intro.2
MAN ioctl.2
MAN issetugid.2
MAN kill.2
INSTALLHDR vmparam.h
MAN kevent.2
MAN kevent64.2
MAN kqueue.2
INSTALLHDR _types.h
MAN lchown.2
MIG mach_port.h
MAN link.2
MAN linkat.2
INSTALLHDR _param.h
MAN listen.2
MAN listxattr.2
MAN lseek.2
INSTALLHDR _mcontext.h
MAN lstat.2
Generating bsd/sys/sysproto.h from /Users/Shared/BSA_10.10.1_rc1/bsd/kern/syscalls.master
MAN lstat64.2
MAN madvise.2
INSTALLHDR endian.h
MAN mincore.2
MAN minherit.2
MAN mkdir.2
INSTALLHDR fasttrap_isa.h
MAN mkdirat.2
MIG mach_vm.h
MAN mkfifo.2
MAN mknod.2
MAN mlock.2
MAN mmap.2
INSTALLHDR param.h
MAN mount.2
MAN mprotect.2
INSTALLHDR profile.h
MAN msync.2
MAN munlock.2
INSTALLHDR signal.h
MAN munmap.2
MAN nfsclnt.2
INSTALLHDR limits.h
MIG mach_voucher.h
Generating libkern/version.h from /Users/Shared/BSA_10.10.1_rc1/libkern/libkern/version.h.template
MAN nfssvc.2
MAN open.2
INSTALLHDR _limits.h
MAN openat.2
MAN pathconf.2
MAN pipe.2
MAN poll.2
MAN posix_madvise.2
INSTALLHDR types.h
MAN pread.2
MAN profil.2
MAN pthread_setugid_np.2
INSTALLHDR vmparam.h
MAN ptrace.2
MAN pwrite.2
MAN quotactl.2
INSTALLHDR _types.h
MIG mach_voucher_attr_control.h
MAN read.2
MAN readlink.2
MAN readlinkat.2
INSTALLHDR _param.h
MAN readv.2
MAN reboot.2
MAN recv.2
INSTALLHDR _mcontext.h
MAN recvfrom.2
MAN recvmsg.2
MAN rename.2
INSTALLHDR disklabel.h
MAN renameat.2
MAN removexattr.2
INSTALLHDR endian.h
MAN revoke.2
MIG memory_object_control.h
MAN rmdir.2
INSTALLHDR param.h
MAN searchfs.2
MAN select.2
MAN sem_close.2
INSTALLHDR profile.h
MAN sem_open.2
MAN sem_post.2
INSTALLHDR signal.h
MAN sem_unlink.2
MAN sem_wait.2
INSTALLHDR limits.h
MAN semctl.2
MAN semget.2
MIG processor.h
INSTALLHDR _limits.h
MAN semop.2
MAN send.2
INSTALLHDR types.h
MAN sendfile.2
MAN sendmsg.2
MAN queue.3
MAN sendto.2
INSTALLHDR vmparam.h
MAN posix_spawn_file_actions_addclose.3
MAN setattrlist.2
MAN posix_spawn_file_actions_init.3
MAN setaudit.2
MAN posix_spawnattr_init.3
INSTALLHDR _types.h
MAN setaudit_addr.2
MAN posix_spawnattr_setbinpref_np.3
MAN setauid.2
MAN posix_spawnattr_setflags.3
MIG processor_set.h
MAN setegid.2
MAN posix_spawnattr_setpgroup.3
INSTALLHDR _param.h
MAN posix_spawnattr_setsigdefault.3
MAN seteuid.2
MAN posix_spawnattr_setsigmask.3
MAN setgid.2
INSTALLHDR _mcontext.h
MAN posix_spawnattr_setspecialport_np.3
MAN setgroups.2
MAN getiopolicy_np.3
MAN setitimer.2
MANLINK CIRCLEQ_ENTRY.3
MAN setlcid.2
MAN setlogin.2
MAN setpgid.2
MAN setpgrp.2
MANLINK CIRCLEQ_HEAD.3
INSTALLHDR aesxts.h
MAN setpriority.2
MANLINK CIRCLEQ_INIT.3
MIG task.h
MAN setregid.2
MANLINK CIRCLEQ_INSERT_AFTER.3
MAN setreuid.2
MANLINK CIRCLEQ_INSERT_BEFORE.3
MAN setrlimit.2
MANLINK CIRCLEQ_INSERT_HEAD.3
MAN setsid.2
MANLINK CIRCLEQ_INSERT_TAIL.3
MAN setsockopt.2
MAN settimeofday.2
MANLINK CIRCLEQ_REMOVE.3
MAN setuid.2
MANLINK LIST_ENTRY.3
MAN setxattr.2
MANLINK LIST_HEAD.3
MAN shm_open.2
MAN shm_unlink.2
MANLINK LIST_INIT.3
MAN shmat.2
MANLINK LIST_INSERT_AFTER.3
MAN shmctl.2
MIG task_access.h
MANLINK LIST_INSERT_BEFORE.3
MAN shmdt.2
MANLINK LIST_INSERT_HEAD.3
MAN shmget.2
MANLINK LIST_REMOVE.3
MAN shutdown.2
MANLINK TAILQ_ENTRY.3
MAN sigaction.2
MAN sigaltstack.2
MANLINK TAILQ_HEAD.3
MAN sigpending.2
MANLINK TAILQ_INIT.3
MAN sigprocmask.2
MANLINK TAILQ_INSERT_AFTER.3
MAN sigstack.2
MANLINK TAILQ_INSERT_BEFORE.3
MAN sigsuspend.2
INSTALLHDR boolean.h
MANLINK TAILQ_INSERT_HEAD.3
MAN socket.2
MAN socketpair.2
MANLINK TAILQ_INSERT_TAIL.3
MAN stat.2
INSTALLHDR exception.h
MIG thread_act.h
MANLINK TAILQ_REMOVE.3
MAN stat64.2
MANLINK posix_spawn_file_actions_addopen.3
Generating bsd/sys/syscall.h from /Users/Shared/BSA_10.10.1_rc1/bsd/kern/syscalls.master
MAN statfs.2
MANLINK posix_spawn_file_actions_adddup2.3
INSTALLHDR fp_reg.h
MAN statfs64.2
MANLINK posix_spawn_file_actions_destroy.3
MAN symlink.2
MANLINK posix_spawnattr_destroy.3
INSTALLHDR processor_info.h
MAN symlinkat.2
MANLINK posix_spawnattr_getbinpref_np.3
MAN sync.2
MANLINK posix_spawnattr_getflags.3
MAN syscall.2
INSTALLHDR kern_return.h
MANLINK posix_spawnattr_getpgroup.3
MAN truncate.2
MANLINK posix_spawnattr_getsigdefault.3
MAN umask.2
MANLINK posix_spawnattr_getsigmask.3
MAN undelete.2
MANLINK posix_spawnattr_setexceptionports_np.3
MAN unlink.2
INSTALLHDR ndr_def.h
MANLINK setiopolicy_np.3
MAN unlinkat.2
MIG upl.h
MAN unmount.2
MAN utimes.2
INSTALLHDR syscall_sw.h
MAN vfork.2
MAN aio.4
MAN wait.2
INSTALLHDR thread_status.h
MAN arp.4
MAN wait3.2
MAN audit.4
MAN wait4.2
MAN auditpipe.4
MAN waitpid.2
INSTALLHDR thread_state.h
MAN bpf.4
MAN write.2
MAN divert.4
MAN writev.2
MAN dummynet.4
MAN posix_spawn.2
INSTALLHDR vm_param.h
MAN fd.4
MANLINK sem_trywait.2
MAN gif.4
MIG vm_map.h
MANLINK posix_spawnp.2
MAN icmp.4
INSTALLHDR vm_types.h
MAN icmp6.4
MAN ifmib.4
MAN inet.4
INSTALLHDR rpc.h
MAN inet6.4
MAN ip.4
MAN ip6.4
MAN ipfirewall.4
MAN acct.5
INSTALLHDR _structs.h
MAN ipl.4
MAN core.5
MAN ipsec.4
MAN dir.5
MAN lo.4
MAN dirent.5
MAN netintro.4
INSTALLHDR sdt_isa.h
MAN types.5
MAN networking.4
MIG audit_triggers_server.h
MAN null.4
INSTALLHDR asm.h
MAN pty.4
MAN random.4
MAN route.4
INSTALLHDR boolean.h
MAN stderr.4
MAN stdin.4
MAN sticky.8
INSTALLHDR exception.h
MAN stdout.4
MAN stf.4
INSTALLHDR fp_reg.h
MAN tcp.4
MAN copy.9
MAN copyin.9
MAN termios.4
MAN copyinstr.9
MAN tty.4
MIG clock_reply_server.h
INSTALLHDR processor_info.h
MAN copyout.9
MAN udp.4
MAN copystr.9
MAN unix.4
MAN fetch.9
MAN urandom.4
INSTALLHDR kern_return.h
MAN fubyte.9
MAN fuibyte.9
MAN fuiword.9
MAN fulong.9
INSTALLHDR ndr_def.h
MAN fuulong.9
MAN fuword.9
MAN store.9
INSTALLHDR syscall_sw.h
MAN style.9
MIG coalition_notification_server.h
MAN subyte.9
INSTALLHDR thread_status.h
MIG default_pager_object.h
MAN suibyte.9
MAN suiword.9
MAN sulong.9
INSTALLHDR thread_state.h
MAN suulong.9
INSTALLHDR boot.h
MAN suword.9
MAN intro.9
INSTALLHDR vm_param.h
INSTALLHDR efi.h
INSTALLHDR vm_types.h
MIG exc_server.h
INSTALLHDR protos.h
INSTALLHDR rpc.h
INSTALLHDR boot.h
INSTALLHDR _structs.h
INSTALLHDR eflags.h
INSTALLHDR efi.h
INSTALLHDR sdt_isa.h
INSTALLHDR asm.h
INSTALLHDR protos.h
INSTALLHDR OSByteOrder.h
INSTALLHDR user_ldt.h
MIG mach_exc_server.h
INSTALLHDR boot.h
INSTALLHDR boolean.h
INSTALLHDR _OSByteOrder.h
INSTALLHDR asm.h
INSTALLHDR exception.h
INSTALLHDR efi.h
INSTALLHDR OSByteOrder.h
INSTALLHDR cpuid.h
INSTALLHDR fp_reg.h
INSTALLHDR protos.h
INSTALLHDR _OSByteOrder.h
INSTALLHDR eflags.h
INSTALLHDR processor_info.h
INSTALLHDR boot.h
INSTALLHDR OSByteOrder.h
INSTALLHDR locks.h
MIG memory_object_server.h
INSTALLHDR kern_return.h
INSTALLHDR efi.h
INSTALLHDR _OSByteOrder.h
INSTALLHDR machine_routines.h
INSTALLHDR ndr_def.h
INSTALLHDR protos.h
INSTALLHDR OSByteOrder.h
INSTALLHDR syscall_sw.h
INSTALLHDR proc_reg.h
INSTALLHDR _OSByteOrder.h
INSTALLHDR vmx.h
INSTALLHDR thread_status.h
INSTALLHDR cpu_capabilities.h
INSTALLHDR thread_state.h
MIG memory_object_default_server.h
INSTALLHDR apic.h
INSTALLHDR vm_param.h
INSTALLHDR asm.h
INSTALLHDR vm_types.h
INSTALLHDR machine_kpc.h
INSTALLHDR cpu_number.h
INSTALLHDR rpc.h
INSTALLHDR asm_help.h
INSTALLHDR machine_kpc.h
INSTALLHDR cpu_capabilities.h
INSTALLHDR _structs.h
MIG notify_server.h
INSTALLHDR cpu.h
INSTALLHDR cpu_topology.h
INSTALLHDR sdt_isa.h
INSTALLHDR io.h
INSTALLHDR cpuid.h
INSTALLHDR asm.h
INSTALLHDR pio.h
INSTALLHDR eflags.h
INSTALLHDR boolean.h
INSTALLHDR sel.h
INSTALLHDR io_map_entries.h
INSTALLHDR exception.h
INSTALLHDR tss.h
MIG task_access_server.h
INSTALLHDR lapic.h
INSTALLHDR fp_reg.h
INSTALLHDR desc.h
INSTALLHDR lock.h
INSTALLHDR processor_info.h
INSTALLHDR reg_help.h
INSTALLHDR locks.h
INSTALLHDR kern_return.h
INSTALLHDR table.h
INSTALLHDR machine_routines.h
INSTALLHDR ndr_def.h
INSTALLHDR asm_help.h
MIG telemetry_notification_server.h
INSTALLHDR machine_cpu.h
INSTALLHDR syscall_sw.h
INSTALLHDR cpu.h
INSTALLHDR mtrr.h
INSTALLHDR io.h
INSTALLHDR thread_status.h
INSTALLHDR mp.h
INSTALLHDR pio.h
INSTALLHDR thread_state.h
INSTALLHDR vm_param.h
INSTALLHDR mp_desc.h
INSTALLHDR vm_types.h
INSTALLHDR sel.h
INSTALLHDR rpc.h
INSTALLHDR mp_events.h
INSTALLHDR _structs.h
INSTALLHDR tss.h
INSTALLHDR sdt_isa.h
INSTALLHDR pal_native.h
INSTALLHDR desc.h
INSTALLHDR asm.h
INSTALLHDR pal_routines.h
INSTALLHDR reg_help.h
INSTALLHDR pal_hibernate.h
INSTALLHDR table.h
INSTALLHDR panic_hooks.h
INSTALLHDR pmCPU.h
MIG gssd_mach.h
MIG kextd_mach.h
INSTALLHDR pmap.h
MIG lockd_mach.h
INSTALLHDR proc_reg.h
INSTALLHDR rtclock_protos.h
INSTALLHDR seg.h
INSTALLHDR simple_lock.h
INSTALLHDR tsc.h
INSTALLHDR tss.h
INSTALLHDR ucode.h
INSTALLHDR vmx.h
INSTALLHDR audit.h
INSTALLHDR audit_domain.h
INSTALLHDR audit_errno.h
INSTALLHDR audit_fcntl.h
INSTALLHDR audit_internal.h
INSTALLHDR IONVRAMController.h
INSTALLHDR audit_kevents.h
INSTALLHDR IONVRAMController.h
C++ IOLib.cpo
INSTALLHDR audit_record.h
INSTALLHDR audit_socket_type.h
INSTALLHDR audit.h
MIG atm_notification_user.c
INSTALLHDR audit.h
INSTALLHDR audit_domain.h
INSTALLHDR AppleMacIO.h
INSTALLHDR audit_errno.h
INSTALLHDR AppleMacIODevice.h
Generating audit_kevents.c from /Users/Shared/BSA_10.10.1_rc1/bsd/kern/syscalls.master
INSTALLHDR audit_fcntl.h
INSTALLHDR AppleNMI.h
INSTALLHDR audit_internal.h
INSTALLHDR ApplePlatformExpert.h
INSTALLHDR audit_kevents.h
INSTALLHDR AppleMacIO.h
INSTALLHDR audit_record.h
INSTALLHDR AppleMacIODevice.h
INSTALLHDR AppleNMI.h
INSTALLHDR audit_socket_type.h
INSTALLHDR audit.h
INSTALLHDR ApplePlatformExpert.h
MIG default_pager_alerts_user.c
INSTALLHDR blowfish.h
INSTALLHDR cast128.h
INSTALLHDR IOPwrController.h
INSTALLHDR IOPwrController.h
CC audit_mac.o
INSTALLHDR rc4.h
INSTALLHDR sha1.h
INSTALLHDR sha2.h
INSTALLHDR des.h
INSTALLHDR aes.h
INSTALLHDR IOPMLibDefs.h
INSTALLHDR aesxts.h
INSTALLHDR IOPM.h
MIG default_pager_object_server.c
INSTALLHDR IOPM.h
INSTALLHDR IOPMLibDefs.h
INSTALLHDR IOPMPowerSource.h
INSTALLHDR hfs_encodings.h
INSTALLHDR IOPMPowerSourceList.h
INSTALLHDR hfs_format.h
INSTALLHDR IOPMpowerState.h
INSTALLHDR hfs_mount.h
C++ IOLocks.cpo
INSTALLHDR IOPowerConnection.h
INSTALLHDR hfs_unistr.h
INSTALLHDR RootDomain.h
INSTALLHDR hfs_encodings.h
INSTALLHDR IOPMPrivate.h
INSTALLHDR hfs_format.h
INSTALLHDR hfs_mount.h
INSTALLHDR IOPM.h
CC audit_pipe.o
INSTALLHDR hfs_unistr.h
INSTALLHDR IOPMLibDefs.h
INSTALLHDR hfs_encodings.h
INSTALLHDR IOPMPowerSource.h
INSTALLHDR hfs_format.h
INSTALLHDR IOPMPowerSourceList.h
C++ IOConditionLock.cpo
MIG device_server.h
INSTALLHDR hfs_mount.h
INSTALLHDR IOPMpowerState.h
INSTALLHDR hfs_unistr.h
INSTALLHDR IOPowerConnection.h
INSTALLHDR hfs.h
INSTALLHDR RootDomain.h
INSTALLHDR hfs_attrlist.h
INSTALLHDR IOPMPrivate.h
INSTALLHDR hfs_catalog.h
INSTALLHDR hfs_cnode.h
INSTALLHDR hfs_endian.h
INSTALLHDR hfs_fsctl.h
INSTALLHDR IORTCController.h
C++ IOStartIOKit.cpo
INSTALLHDR hfs_macos_defs.h
INSTALLHDR IORTCController.h
INSTALLHDR hfs_quota.h
MIG device_server.c
INSTALLHDR rangelist.h
INSTALLHDR hfs_encodings.h
INSTALLHDR hfs_format.h
INSTALLHDR IOWatchDogTimer.h
INSTALLHDR hfs_mount.h
INSTALLHDR IOWatchDogTimer.h
INSTALLHDR hfs_unistr.h
CC audit_session.o
INSTALLHDR libkern.h
C++ IODeviceTreeSupport.cpo
INSTALLHDR libkern.h
INSTALLHDR IOBSD.h
INSTALLHDR IOKitKeys.h
INSTALLHDR IOKitServer.h
INSTALLHDR byte_order.h
INSTALLHDR IOReturn.h
INSTALLHDR endian.h
INSTALLHDR IOSharedLock.h
INSTALLHDR fasttrap_isa.h
INSTALLHDR IOTypes.h
INSTALLHDR limits.h
MIG audit_triggers_user.c
INSTALLHDR OSMessageNotification.h
INSTALLHDR param.h
INSTALLHDR IODataQueueShared.h
INSTALLHDR profile.h
INSTALLHDR IOMessage.h
INSTALLHDR signal.h
INSTALLHDR types.h
INSTALLHDR IOInterruptAccounting.h
INSTALLHDR vmparam.h
INSTALLHDR IOBSD.h
INSTALLHDR _types.h
INSTALLHDR IOBufferMemoryDescriptor.h
C++ IORegistryEntry.cpo
INSTALLHDR _limits.h
MIG clock_reply_user.c
INSTALLHDR IOCatalogue.h
INSTALLHDR _param.h
INSTALLHDR IOCommand.h
INSTALLHDR _mcontext.h
INSTALLHDR IOCommandGate.h
INSTALLHDR disklabel.h
INSTALLHDR IOCommandPool.h
INSTALLHDR byte_order.h
INSTALLHDR endian.h
INSTALLHDR IOConditionLock.h
INSTALLHDR limits.h
INSTALLHDR IODMACommand.h
INSTALLHDR param.h
INSTALLHDR IODMAController.h
MIG coalition_notification_user.c
INSTALLHDR IODMAEventSource.h
INSTALLHDR profile.h
INSTALLHDR IODataQueue.h
INSTALLHDR signal.h
CC audit_syscalls.o
INSTALLHDR IODataQueueShared.h
INSTALLHDR spl.h
INSTALLHDR IODeviceMemory.h
INSTALLHDR types.h
INSTALLHDR IODeviceTreeSupport.h
INSTALLHDR vmparam.h
INSTALLHDR IOEventSource.h
INSTALLHDR _types.h
INSTALLHDR IOFilterInterruptEventSource.h
INSTALLHDR _limits.h
INSTALLHDR IOInterleavedMemoryDescriptor.h
INSTALLHDR _param.h
INSTALLHDR IOInterruptAccounting.h
INSTALLHDR _mcontext.h
C++ IOService.cpo
INSTALLHDR IOInterruptController.h
INSTALLHDR byte_order.h
INSTALLHDR endian.h
INSTALLHDR IOInterruptEventSource.h
INSTALLHDR fasttrap_isa.h
INSTALLHDR IOInterrupts.h
MIG exc_user.c
INSTALLHDR limits.h
INSTALLHDR IOKernelReportStructs.h
INSTALLHDR param.h
INSTALLHDR IOKitDebug.h
INSTALLHDR profile.h
INSTALLHDR IOKitKeys.h
INSTALLHDR signal.h
INSTALLHDR IOKitServer.h
INSTALLHDR types.h
INSTALLHDR IOLib.h
INSTALLHDR vmparam.h
INSTALLHDR IOLocks.h
INSTALLHDR _types.h
INSTALLHDR IOMapper.h
INSTALLHDR _limits.h
INSTALLHDR _param.h
INSTALLHDR IOMemoryCursor.h
INSTALLHDR _mcontext.h
INSTALLHDR IOMemoryDescriptor.h
INSTALLHDR disklabel.h
INSTALLHDR IOMessage.h
MIG host_notify_reply_user.c
INSTALLHDR disklabel.h
INSTALLHDR IOMultiMemoryDescriptor.h
INSTALLHDR byte_order.h
INSTALLHDR IONVRAM.h
INSTALLHDR endian.h
INSTALLHDR IONotifier.h
INSTALLHDR limits.h
INSTALLHDR IOPlatformExpert.h
INSTALLHDR param.h
INSTALLHDR IORangeAllocator.h
INSTALLHDR profile.h
INSTALLHDR IORegistryEntry.h
INSTALLHDR signal.h
INSTALLHDR IOReportMacros.h
INSTALLHDR spl.h
INSTALLHDR IOReportTypes.h
INSTALLHDR types.h
INSTALLHDR IOReturn.h
INSTALLHDR vmparam.h
MIG mach_exc_user.c
INSTALLHDR IOService.h
INSTALLHDR _types.h
INSTALLHDR IOServicePM.h
INSTALLHDR _limits.h
INSTALLHDR IOSharedDataQueue.h
INSTALLHDR _param.h
INSTALLHDR IOSharedLock.h
INSTALLHDR _mcontext.h
INSTALLHDR IOSubMemoryDescriptor.h
INSTALLHDR IOTimeStamp.h
INSTALLHDR IOTimerEventSource.h
INSTALLHDR devfs.h
INSTALLHDR IOTypes.h
INSTALLHDR devfs.h
INSTALLHDR IOUserClient.h
CC audit_worker.o
INSTALLHDR devfs.h
INSTALLHDR IOWorkLoop.h
INSTALLHDR devfs.h
INSTALLHDR OSMessageNotification.h
MIG mach_notify_user.c
INSTALLHDR assert.h
INSTALLHDR devfs_proto.h
INSTALLHDR system.h
INSTALLHDR devfsdefs.h
INSTALLHDR IOKitKeysPrivate.h
INSTALLHDR IOHibernatePrivate.h
INSTALLHDR fifo.h
INSTALLHDR IOLocksPrivate.h
INSTALLHDR fifo.h
INSTALLHDR IOStatistics.h
INSTALLHDR AppleKeyStoreInterface.h
INSTALLHDR IOReportTypes.h
INSTALLHDR specdev.h
INSTALLHDR IOKernelReportStructs.h
INSTALLHDR specdev.h
INSTALLHDR IOReportMacros.h
MIG memory_object_user.c
INSTALLHDR specdev.h
INSTALLHDR AppleKeyStoreInterface.h
INSTALLHDR specdev.h
INSTALLHDR IOBSD.h
INSTALLHDR IOBufferMemoryDescriptor.h
INSTALLHDR IOCPU.h
INSTALLHDR IOCatalogue.h
INSTALLHDR union.h
INSTALLHDR IOCommand.h
INSTALLHDR union.h
INSTALLHDR union.h
INSTALLHDR IOCommandGate.h
INSTALLHDR union.h
INSTALLHDR IOCommandPool.h
INSTALLHDR IOCommandQueue.h
INSTALLHDR IOConditionLock.h
INSTALLHDR IODMACommand.h
MIG memory_object_control_user.c
INSTALLHDR altq.h
INSTALLHDR IODMAController.h
INSTALLHDR altq_cbq.h
INSTALLHDR IODMAEventSource.h
INSTALLHDR altq_fairq.h
INSTALLHDR IODataQueue.h
INSTALLHDR altq_hfsc.h
INSTALLHDR IODataQueueShared.h
INSTALLHDR altq_priq.h
INSTALLHDR IODeviceMemory.h
INSTALLHDR altq_qfq.h
INSTALLHDR IODeviceTreeSupport.h
INSTALLHDR altq.h
INSTALLHDR IOEventSource.h
INSTALLHDR altq_cbq.h
CC bsd_init.o
INSTALLHDR IOFilterInterruptEventSource.h
INSTALLHDR altq_fairq.h
INSTALLHDR IOHibernatePrivate.h
INSTALLHDR altq_hfsc.h
INSTALLHDR IOInterleavedMemoryDescriptor.h
MIG memory_object_default_user.c
INSTALLHDR altq_priq.h
INSTALLHDR IOInterruptAccounting.h
INSTALLHDR altq_qfq.h
C++ IOServicePM.cpo
INSTALLHDR IOInterruptController.h
INSTALLHDR IOInterruptEventSource.h
INSTALLHDR IOInterrupts.h
INSTALLHDR classq.h
INSTALLHDR IOKernelReportStructs.h
INSTALLHDR classq_blue.h
INSTALLHDR IOKernelReporters.h
INSTALLHDR classq_red.h
INSTALLHDR classq_rio.h
INSTALLHDR IOKitDebug.h
MIG task_access_user.c
INSTALLHDR classq_sfb.h
INSTALLHDR IOKitKeys.h
INSTALLHDR if_classq.h
INSTALLHDR IOKitKeysPrivate.h
INSTALLHDR classq.h
INSTALLHDR IOKitServer.h
INSTALLHDR classq_blue.h
INSTALLHDR IOLib.h
INSTALLHDR classq_red.h
INSTALLHDR IOLocks.h
INSTALLHDR classq_rio.h
INSTALLHDR IOLocksPrivate.h
INSTALLHDR classq_sfb.h
INSTALLHDR IOMapper.h
INSTALLHDR if_classq.h
INSTALLHDR IOMemoryCursor.h
INSTALLHDR IOMemoryDescriptor.h
INSTALLHDR pktsched.h
INSTALLHDR pktsched_cbq.h
INSTALLHDR IOMessage.h
INSTALLHDR pktsched_fairq.h
INSTALLHDR IOMultiMemoryDescriptor.h
MIG telemetry_notification_user.c
INSTALLHDR pktsched_hfsc.h
INSTALLHDR IONVRAM.h
INSTALLHDR pktsched_priq.h
INSTALLHDR IONotifier.h
INSTALLHDR pktsched_tcq.h
INSTALLHDR IOPlatformExpert.h
INSTALLHDR pktsched_rmclass.h
INSTALLHDR IOPolledInterface.h
INSTALLHDR pktsched_qfq.h
INSTALLHDR IORangeAllocator.h
INSTALLHDR pktsched.h
INSTALLHDR IORegistryEntry.h
INSTALLHDR pktsched_cbq.h
INSTALLHDR IOReportMacros.h
INSTALLHDR pktsched_fairq.h
INSTALLHDR IOReportTypes.h
INSTALLHDR pktsched_hfsc.h
INSTALLHDR IOReturn.h
Generating init_sysent.c from /Users/Shared/BSA_10.10.1_rc1/bsd/kern/syscalls.master
INSTALLHDR pktsched_priq.h
INSTALLHDR IOService.h
MIG upl_user.c
INSTALLHDR pktsched_tcq.h
INSTALLHDR IOServicePM.h
INSTALLHDR pktsched_rmclass.h
INSTALLHDR IOSharedDataQueue.h
INSTALLHDR pktsched_qfq.h
INSTALLHDR IOSharedLock.h
INSTALLHDR IOStatistics.h
INSTALLHDR IOStatisticsPrivate.h
INSTALLHDR bpf.h
INSTALLHDR IOSubMemoryDescriptor.h
INSTALLHDR dlil.h
INSTALLHDR IOSyncer.h
INSTALLHDR ethernet.h
INSTALLHDR IOTimeStamp.h
INSTALLHDR if.h
INSTALLHDR IOTimerEventSource.h
MIG vm_map_user.c
INSTALLHDR if_arp.h
INSTALLHDR IOTypes.h
INSTALLHDR if_dl.h
CC kdebug.o
INSTALLHDR IOUserClient.h
INSTALLHDR if_llc.h
INSTALLHDR IOWorkLoop.h
INSTALLHDR if_media.h
INSTALLHDR OSMessageNotification.h
INSTALLHDR if_mib.h
INSTALLHDR assert.h
INSTALLHDR if_types.h
INSTALLHDR system.h
INSTALLHDR if_var.h
INSTALLHDR if_utun.h
INSTALLHDR kext_net.h
INSTALLHDR ndrv.h
MIG clock_server.c
INSTALLHDR pfkeyv2.h
INSTALLHDR route.h
INSTALLHDR bpf.h
CC device_tree.o
INSTALLHDR dlil.h
INSTALLHDR ethernet.h
INSTALLHDR if.h
INSTALLHDR if_arp.h
INSTALLHDR if_dl.h
INSTALLHDR if_llc.h
CC bootargs.o
INSTALLHDR if_media.h
MIG clock_priv_server.c
INSTALLHDR if_mib.h
INSTALLHDR if_types.h
INSTALLHDR if_var.h
INSTALLHDR if_utun.h
INSTALLHDR kext_net.h
INSTALLHDR ndrv.h
CC pe_gen.o
INSTALLHDR pfkeyv2.h
INSTALLHDR route.h
INSTALLHDR kpi_interface.h
INSTALLHDR kpi_interfacefilter.h
INSTALLHDR kpi_protocol.h
CC pe_init.o
MIG exc_server.c
INSTALLHDR if_ether.h
INSTALLHDR init.h
INSTALLHDR radix.h
INSTALLHDR bpf.h
INSTALLHDR dlil.h
INSTALLHDR ethernet.h
INSTALLHDR if.h
INSTALLHDR if_arp.h
INSTALLHDR if_dl.h
MIG host_priv_server.c
CC pe_bootargs.o
INSTALLHDR if_llc.h
C++ IOPMinformee.cpo
INSTALLHDR if_media.h
INSTALLHDR if_mib.h
INSTALLHDR if_types.h
CC pe_identify_machine.o
INSTALLHDR if_var.h
INSTALLHDR if_utun.h
INSTALLHDR kext_net.h
INSTALLHDR ndrv.h
INSTALLHDR pfkeyv2.h
CC pe_kprintf.o
INSTALLHDR route.h
INSTALLHDR if_vlan_var.h
C++ IOPMinformeeList.cpo
INSTALLHDR if_ppp.h
MIG host_security_server.c
INSTALLHDR firewire.h
INSTALLHDR ppp_defs.h
INSTALLHDR radix.h
INSTALLHDR if_bond_var.h
CC pe_interrupt.o
INSTALLHDR if_bond_internal.h
INSTALLHDR lacp.h
INSTALLHDR ndrv_var.h
INSTALLHDR netsrc.h
CC pe_serial.o
INSTALLHDR raw_cb.h
C++ IOPMPowerStateQueue.cpo
INSTALLHDR etherdefs.h
INSTALLHDR if_pflog.h
MIG lock_set_server.c
INSTALLHDR pfvar.h
INSTALLHDR if_bridgevar.h
INSTALLHDR ntstat.h
LDFILELIST pexpert
INSTALLHDR iptap.h
CC kern_acct.o
INSTALLHDR if_llreach.h
MIG UNDRequest.c
INSTALLHDR if_utun_crypto.h
INSTALLHDR if_utun_crypto_ipsec.h
INSTALLHDR if_utun_crypto_dtls.h
INSTALLHDR pktap.h
INSTALLHDR if_ipsec.h
INSTALLHDR necp.h
INSTALLHDR content_filter.h
C++ IOCatalogue.cpo
INSTALLHDR packet_mangler.h
MIG mach_exc_server.c
INSTALLHDR bpf.h
INSTALLHDR dlil.h
INSTALLHDR ethernet.h
INSTALLHDR if.h
INSTALLHDR if_arp.h
MIG UNDReplyServer.c
INSTALLHDR if_dl.h
CC kern_aio.o
INSTALLHDR if_llc.h
MIG mach_host_server.c
INSTALLHDR if_media.h
INSTALLHDR if_mib.h
INSTALLHDR if_types.h
INSTALLHDR if_var.h
INSTALLHDR if_utun.h
INSTALLHDR kext_net.h
INSTALLHDR ndrv.h
INSTALLHDR pfkeyv2.h
C++ IOPMPowerSource.cpo
INSTALLHDR route.h
INSTALLHDR if_vlan_var.h
MIG mach_notify_server.c
INSTALLHDR if_ppp.h
INSTALLHDR firewire.h
INSTALLHDR ppp_defs.h
INSTALLHDR radix.h
CC OSRuntimeSupport.o
INSTALLHDR if_bond_var.h
INSTALLHDR if_bond_internal.h
INSTALLHDR lacp.h
C++ OSSerialize.cpo
INSTALLHDR ndrv_var.h
INSTALLHDR netsrc.h
INSTALLHDR raw_cb.h
INSTALLHDR etherdefs.h
INSTALLHDR if_pflog.h
MIG mach_port_server.c
INSTALLHDR pfvar.h
C++ OSSet.cpo
INSTALLHDR if_bridgevar.h
INSTALLHDR ntstat.h
INSTALLHDR iptap.h
INSTALLHDR if_llreach.h
INSTALLHDR if_utun_crypto.h
C++ OSString.cpo
INSTALLHDR if_utun_crypto_ipsec.h
C++ IOPMPowerSourceList.cpo
INSTALLHDR if_utun_crypto_dtls.h
INSTALLHDR pktap.h
INSTALLHDR if_ipsec.h
INSTALLHDR necp.h
C++ OSSymbol.cpo
INSTALLHDR content_filter.h
INSTALLHDR packet_mangler.h
MIG mach_vm_server.c
INSTALLHDR kpi_interface.h
INSTALLHDR kpi_interfacefilter.h
INSTALLHDR kpi_protocol.h
C++ IOPolledInterface.cpo
INSTALLHDR if_ether.h
INSTALLHDR init.h
C++ OSUnserialize.cpo
INSTALLHDR bpfdesc.h
INSTALLHDR ppp_comp.h
INSTALLHDR zlib.h
INSTALLHDR bpf_compat.h
INSTALLHDR net_osdep.h
MIG mach_voucher_server.c
INSTALLHDR flowadv.h
C++ IOWorkLoop.cpo
C++ OSUnserializeXML.cpo
INSTALLHDR bootp.h
INSTALLHDR icmp6.h
INSTALLHDR if_ether.h
INSTALLHDR icmp_var.h
CC kern_authorization.o
INSTALLHDR igmp.h
INSTALLHDR igmp_var.h
INSTALLHDR in.h
MIG mach_voucher_attr_control_server.c
INSTALLHDR in_pcb.h
INSTALLHDR in_systm.h
INSTALLHDR in_var.h
C++ IOEventSource.cpo
INSTALLHDR ip.h
INSTALLHDR ip6.h
INSTALLHDR ip_icmp.h
INSTALLHDR ip_var.h
INSTALLHDR tcp.h
C++ OSSerializeBinary.cpo
INSTALLHDR tcp_fsm.h
INSTALLHDR tcp_seq.h
MIG memory_object_server.c
INSTALLHDR tcp_timer.h
INSTALLHDR tcp_var.h
INSTALLHDR tcpip.h
INSTALLHDR udp.h
INSTALLHDR udp_var.h
INSTALLHDR bootp.h
C++ IOInterruptEventSource.cpo
INSTALLHDR icmp6.h
INSTALLHDR if_ether.h
C++ OSKextLib.cpo
INSTALLHDR icmp_var.h
INSTALLHDR igmp.h
MIG memory_object_control_server.c
INSTALLHDR igmp_var.h
INSTALLHDR in.h
INSTALLHDR in_pcb.h
INSTALLHDR in_systm.h
INSTALLHDR in_var.h
CC mkext.o
INSTALLHDR ip.h
CC kern_clock.o
INSTALLHDR ip6.h
INSTALLHDR ip_icmp.h
INSTALLHDR ip_var.h
MIG memory_object_default_server.c
INSTALLHDR tcp.h
CC OSKextVersion.o
INSTALLHDR tcp_fsm.h
C++ IOCommandGate.cpo
INSTALLHDR tcp_seq.h
INSTALLHDR tcp_timer.h
INSTALLHDR tcp_var.h
INSTALLHDR tcpip.h
INSTALLHDR udp.h
CC kern_core.o
INSTALLHDR udp_var.h
INSTALLHDR kpi_ipfilter.h
CC inet_aton.o
INSTALLHDR in_arp.h
INSTALLHDR bootp.h
INSTALLHDR icmp6.h
INSTALLHDR if_ether.h
MIG processor_server.c
INSTALLHDR icmp_var.h
INSTALLHDR igmp.h
INSTALLHDR igmp_var.h
CC inet_ntoa.o
C++ IOCommand.cpo
INSTALLHDR in.h
INSTALLHDR in_pcb.h
INSTALLHDR in_systm.h
C++ IOCommandPool.cpo
INSTALLHDR in_var.h
INSTALLHDR ip.h
CC inet_ntop.o
INSTALLHDR ip6.h
INSTALLHDR ip_icmp.h
INSTALLHDR ip_var.h
CC kern_credential.o
INSTALLHDR tcp.h
INSTALLHDR tcp_fsm.h
INSTALLHDR tcp_seq.h
MIG processor_set_server.c
INSTALLHDR tcp_timer.h
CC inet_pton.o
INSTALLHDR tcp_var.h
INSTALLHDR tcpip.h
C++ IOCommandQueue.cpo
INSTALLHDR udp.h
INSTALLHDR udp_var.h
C++ IODMAEventSource.cpo
INSTALLHDR ip_dummynet.h
CC scanf.o
INSTALLHDR ip_flowid.h
MIG task_server.c
INSTALLHDR ip_fw.h
INSTALLHDR ip_fw2.h
INSTALLHDR tcp_debug.h
INSTALLHDR in_gif.h
INSTALLHDR ip_compat.h
INSTALLHDR flow_divert_proto.h
INSTALLHDR mptcp_var.h
INSTALLHDR bootp.h
INSTALLHDR icmp6.h
INSTALLHDR if_ether.h
CC uuid.o
INSTALLHDR icmp_var.h
MIG thread_act_server.c
C++ IOFilterInterruptEventSource.cpo
INSTALLHDR igmp.h
INSTALLHDR igmp_var.h
INSTALLHDR in.h
INSTALLHDR in_pcb.h
INSTALLHDR in_systm.h
INSTALLHDR in_var.h
CC kernel_mach_header.o
INSTALLHDR ip.h
INSTALLHDR ip6.h
INSTALLHDR ip_icmp.h
INSTALLHDR ip_var.h
INSTALLHDR tcp.h
INSTALLHDR tcp_fsm.h
INSTALLHDR tcp_seq.h
CC adler32.o
INSTALLHDR tcp_timer.h
MIG upl_server.c
INSTALLHDR tcp_var.h
INSTALLHDR tcpip.h
C++ IOTimerEventSource.cpo
INSTALLHDR udp.h
INSTALLHDR udp_var.h
CC compress.o
INSTALLHDR ip_dummynet.h
INSTALLHDR ip_flowid.h
CC crc32.o
INSTALLHDR ip_fw.h
INSTALLHDR ip_fw2.h
INSTALLHDR tcp_debug.h
INSTALLHDR in_gif.h
MIG vm_map_server.c
INSTALLHDR ip_compat.h
INSTALLHDR flow_divert_proto.h
INSTALLHDR mptcp_var.h
C++ IOBufferMemoryDescriptor.cpo
CC deflate.o
INSTALLHDR kpi_ipfilter.h
INSTALLHDR in_arp.h
INSTALLHDR ip_ecn.h
INSTALLHDR ip_encap.h
INSTALLHDR ah.h
INSTALLHDR ipsec.h
MIG vm32_map_server.c
INSTALLHDR esp.h
INSTALLHDR in6.h
INSTALLHDR ipcomp.h
INSTALLHDR raw_ip6.h
INSTALLHDR in6_var.h
C++ IODMACommand.cpo
INSTALLHDR nd6.h
INSTALLHDR ah.h
INSTALLHDR ipsec.h
INSTALLHDR esp.h
INSTALLHDR in6.h
MIG gssd_mach.c
INSTALLHDR ipcomp.h
INSTALLHDR raw_ip6.h
INSTALLHDR in6_var.h
INSTALLHDR nd6.h
INSTALLHDR ah.h
CC infback.o
CC kern_cs.o
INSTALLHDR ipsec.h
INSTALLHDR esp.h
INSTALLHDR in6.h
INSTALLHDR ipcomp.h
INSTALLHDR raw_ip6.h
INSTALLHDR in6_var.h
INSTALLHDR nd6.h
MIG gssd_mach.h
INSTALLHDR in6_pcb.h
INSTALLHDR ip6_var.h
INSTALLHDR mld6_var.h
INSTALLHDR ip6_fw.h
C++ IODeviceMemory.cpo
INSTALLHDR ah.h
INSTALLHDR ipsec.h
INSTALLHDR esp.h
INSTALLHDR in6.h
CC inffast.o
INSTALLHDR ipcomp.h
INSTALLHDR raw_ip6.h
C++ IOInterleavedMemoryDescriptor.cpo
INSTALLHDR in6_var.h
INSTALLHDR nd6.h
MIG kextd_mach.c
INSTALLHDR in6_pcb.h
CC kern_csr.o
INSTALLHDR ip6_var.h
INSTALLHDR mld6_var.h
INSTALLHDR ip6_fw.h
CC inflate.o
INSTALLHDR ah6.h
INSTALLHDR esp6.h
INSTALLHDR esp_rijndael.h
INSTALLHDR in6_gif.h
INSTALLHDR in6_ifattach.h
INSTALLHDR ip6_ecn.h
C++ IOMapper.cpo
INSTALLHDR ip6protosw.h
INSTALLHDR ipcomp6.h
INSTALLHDR ipsec6.h
MIG kextd_mach.h
INSTALLHDR scope6_var.h
INSTALLHDR tcp6_var.h
CC kern_symfile.o
INSTALLHDR udp6_var.h
INSTALLHDR keysock.h
INSTALLHDR keysock.h
INSTALLHDR keysock.h
INSTALLHDR key_debug.h
INSTALLHDR keydb.h
INSTALLHDR key_var.h
MIG lockd_mach.c
INSTALLHDR keysock.h
INSTALLHDR key_debug.h
C++ IOMemoryCursor.cpo
INSTALLHDR keydb.h
INSTALLHDR key_var.h
INSTALLHDR key.h
CC kern_descrip.o
INSTALLHDR krpc.h
INSTALLHDR nfs.h
C++ IOMemoryDescriptor.cpo
INSTALLHDR nfsdiskless.h
MIG lockd_mach.h
INSTALLHDR nfsm_subs.h
INSTALLHDR nfsmount.h
INSTALLHDR nfsnode.h
INSTALLHDR nfs_lock.h
INSTALLHDR nfs_gss.h
INSTALLHDR nfs_ioctl.h
INSTALLHDR nfsproto.h
INSTALLHDR nfsrvcache.h
INSTALLHDR rpcv2.h
INSTALLHDR xdr_subs.h
GENASSYM /Users/Shared/BSA_10.10.1_rc1/osfmk/i386/genassym.c
INSTALLHDR krpc.h
CC inftrees.o
INSTALLHDR nfs.h
INSTALLHDR nfsdiskless.h
INSTALLHDR nfsm_subs.h
CC bsd_i386.o
INSTALLHDR nfsmount.h
INSTALLHDR nfsnode.h
CC trees.o
INSTALLHDR nfs_lock.h
INSTALLHDR nfs_gss.h
INSTALLHDR nfs_ioctl.h
INSTALLHDR nfsproto.h
INSTALLHDR nfsrvcache.h
INSTALLHDR rpcv2.h
INSTALLHDR xdr_subs.h
INSTALLHDR audit_ioctl.h
INSTALLHDR audit_ioctl.h
INSTALLHDR audit_ioctl.h
CC bsd_i386_native.o
INSTALLHDR audit_ioctl.h
INSTALLHDR audit.h
CC uncompr.o
INSTALLHDR audit_bsd.h
INSTALLHDR audit_private.h
CC zutil.o
C++ IOMultiMemoryDescriptor.cpo
CC register_crypto.o
INSTALLHDR _blkcnt_t.h
CC corecrypto_sha2.o
INSTALLHDR _blksize_t.h
CC machdep_call.o
C++ IORangeAllocator.cpo
INSTALLHDR _clock_t.h
CC boot_pt.o
INSTALLHDR _ct_rune_t.h
CC corecrypto_sha1.o
INSTALLHDR _dev_t.h
INSTALLHDR _errno_t.h
INSTALLHDR _fd_clr.h
INSTALLHDR _fd_copy.h
INSTALLHDR _fd_def.h
C++ IOSubMemoryDescriptor.cpo
CC corecrypto_md5.o
INSTALLHDR _fd_isset.h
INSTALLHDR _fd_set.h
INSTALLHDR _fd_setsize.h
INSTALLHDR _fd_zero.h
CC corecrypto_des.o
INSTALLHDR _filesec_t.h
INSTALLHDR _fsblkcnt_t.h
INSTALLHDR _fsfilcnt_t.h
CC mp_desc.o
C++ IOPlatformExpert.cpo
INSTALLHDR _fsid_t.h
INSTALLHDR _gid_t.h
INSTALLHDR _guid_t.h
CC corecrypto_aes.o
INSTALLHDR _id_t.h
INSTALLHDR _in_addr_t.h
INSTALLHDR _in_port_t.h
INSTALLHDR _ino64_t.h
INSTALLHDR _ino_t.h
CC corecrypto_aesxts.o
INSTALLHDR _int16_t.h
INSTALLHDR _int32_t.h
INSTALLHDR _int64_t.h
INSTALLHDR _int8_t.h
CC stack_protector.o
INSTALLHDR _intptr_t.h
INSTALLHDR _iovec_t.h
INSTALLHDR _key_t.h
CC kxld.o
INSTALLHDR _mach_port_t.h
INSTALLHDR _mbstate_t.h
INSTALLHDR _mode_t.h
INSTALLHDR _nlink_t.h
INSTALLHDR _null.h
CC kern_guarded.o
INSTALLHDR _o_dsync.h
INSTALLHDR _o_sync.h
CC kxld_array.o
INSTALLHDR _off_t.h
INSTALLHDR _offsetof.h
CC gdt.o
INSTALLHDR _os_inline.h
INSTALLHDR _pid_t.h
INSTALLHDR _posix_vdisable.h
CC cpu.o
INSTALLHDR _ptrdiff_t.h
INSTALLHDR _rsize_t.h
CC kxld_copyright.o
INSTALLHDR _rune_t.h
INSTALLHDR _s_ifmt.h
INSTALLHDR _sa_family_t.h
INSTALLHDR _seek_set.h
INSTALLHDR _sigaltstack.h
CC kxld_demangle.o
INSTALLHDR _sigset_t.h
C++ IOCPU.cpo
INSTALLHDR _size_t.h
CC kxld_dict.o
INSTALLHDR _socklen_t.h
INSTALLHDR _ssize_t.h
INSTALLHDR _suseconds_t.h
CC cpuid.o
INSTALLHDR _time_t.h
INSTALLHDR _timespec.h
INSTALLHDR _timeval.h
CC kxld_kext.o
INSTALLHDR _timeval32.h
INSTALLHDR _ucontext.h
INSTALLHDR _ucontext64.h
INSTALLHDR _uid_t.h
INSTALLHDR _uintptr_t.h
INSTALLHDR _useconds_t.h
INSTALLHDR _uuid_t.h
CC kern_event.o
INSTALLHDR _va_list.h
CC kxld_reloc.o
INSTALLHDR _wchar_t.h
C++ IONVRAM.cpo
INSTALLHDR _wint_t.h
INSTALLHDR _blkcnt_t.h
INSTALLHDR _blksize_t.h
INSTALLHDR _clock_t.h
INSTALLHDR _ct_rune_t.h
INSTALLHDR _dev_t.h
INSTALLHDR _errno_t.h
INSTALLHDR _fd_clr.h
CC kxld_object.o
INSTALLHDR _fd_copy.h
INSTALLHDR _fd_def.h
INSTALLHDR _fd_isset.h
INSTALLHDR _fd_set.h
INSTALLHDR _fd_setsize.h
INSTALLHDR _fd_zero.h
INSTALLHDR _filesec_t.h
INSTALLHDR _fsblkcnt_t.h
INSTALLHDR _fsfilcnt_t.h
INSTALLHDR _fsid_t.h
INSTALLHDR _gid_t.h
INSTALLHDR _guid_t.h
INSTALLHDR _id_t.h
C++ IODMAController.cpo
INSTALLHDR _in_addr_t.h
INSTALLHDR _in_port_t.h
INSTALLHDR _ino64_t.h
INSTALLHDR _ino_t.h
CC kxld_sect.o
INSTALLHDR _int16_t.h
INSTALLHDR _int32_t.h
INSTALLHDR _int64_t.h
INSTALLHDR _int8_t.h
INSTALLHDR _intptr_t.h
CC cpu_threads.o
INSTALLHDR _iovec_t.h
INSTALLHDR _key_t.h
CC kxld_seg.o
INSTALLHDR _mach_port_t.h
INSTALLHDR _mbstate_t.h
C++ IOInterruptController.cpo
INSTALLHDR _mode_t.h
INSTALLHDR _nlink_t.h
INSTALLHDR _null.h
INSTALLHDR _o_dsync.h
CC kxld_srcversion.o
INSTALLHDR _o_sync.h
INSTALLHDR _off_t.h
INSTALLHDR _offsetof.h
INSTALLHDR _os_inline.h
CC kxld_sym.o
INSTALLHDR _pid_t.h
INSTALLHDR _posix_vdisable.h
INSTALLHDR _ptrdiff_t.h
INSTALLHDR _rsize_t.h
INSTALLHDR _rune_t.h
C++ IOUserClient.cpo
INSTALLHDR _s_ifmt.h
INSTALLHDR _sa_family_t.h
INSTALLHDR _seek_set.h
CC kxld_symtab.o
INSTALLHDR _sigaltstack.h
INSTALLHDR _sigset_t.h
INSTALLHDR _size_t.h
CC cpu_topology.o
INSTALLHDR _socklen_t.h
INSTALLHDR _ssize_t.h
INSTALLHDR _suseconds_t.h
INSTALLHDR _time_t.h
INSTALLHDR _timespec.h
INSTALLHDR _timeval.h
CC kxld_util.o
INSTALLHDR _timeval32.h
INSTALLHDR _ucontext.h
INSTALLHDR _ucontext64.h
CC i386_timer.o
INSTALLHDR _uid_t.h
INSTALLHDR _uintptr_t.h
INSTALLHDR _useconds_t.h
INSTALLHDR _uuid_t.h
CC kern_control.o
INSTALLHDR _va_list.h
CC kxld_uuid.o
INSTALLHDR _wchar_t.h
INSTALLHDR _wint_t.h
INSTALLHDR _user_timespec.h
INSTALLHDR _user64_timespec.h
CC kxld_versionmin.o
INSTALLHDR _user32_timespec.h
CC fpu.o
INSTALLHDR _user_timeval.h
INSTALLHDR _user64_timeval.h
CC kxld_vtable.o
INSTALLHDR _user32_timeval.h
INSTALLHDR _user64_itimerval.h
INSTALLHDR _user32_itimerval.h
INSTALLHDR _blkcnt_t.h
INSTALLHDR _blksize_t.h
INSTALLHDR _clock_t.h
INSTALLHDR _ct_rune_t.h
INSTALLHDR _dev_t.h
INSTALLHDR _errno_t.h
CC kxld_stubs.o
INSTALLHDR _fd_clr.h
INSTALLHDR _fd_copy.h
ERROR: ctfconvert: file does not contain dwarf type data (try compiling with -g)
CC OSAtomicOperations.o
INSTALLHDR _fd_def.h
INSTALLHDR _fd_isset.h
CC i386_init.o
INSTALLHDR _fd_set.h
INSTALLHDR _fd_setsize.h
INSTALLHDR _fd_zero.h
INSTALLHDR _filesec_t.h
C++ OSDebug.cpo
INSTALLHDR _fsblkcnt_t.h
INSTALLHDR _fsfilcnt_t.h
INSTALLHDR _fsid_t.h
INSTALLHDR _gid_t.h
C++ IOKitDebug.cpo
INSTALLHDR _guid_t.h
INSTALLHDR _id_t.h
C++ OSMetaClass.cpo
INSTALLHDR _in_addr_t.h
INSTALLHDR _in_port_t.h
INSTALLHDR _ino64_t.h
CC i386_vm_init.o
INSTALLHDR _ino_t.h
INSTALLHDR _int16_t.h
INSTALLHDR _int32_t.h
INSTALLHDR _int64_t.h
CC kern_exec.o
INSTALLHDR _int8_t.h
C++ IODataQueue.cpo
INSTALLHDR _intptr_t.h
INSTALLHDR _iovec_t.h
INSTALLHDR _key_t.h
INSTALLHDR _mach_port_t.h
INSTALLHDR _mbstate_t.h
INSTALLHDR _mode_t.h
INSTALLHDR _nlink_t.h
C++ OSObject.cpo
C++ IOSharedDataQueue.cpo
INSTALLHDR _null.h
INSTALLHDR _o_dsync.h
CC io_map.o
INSTALLHDR _o_sync.h
INSTALLHDR _off_t.h
INSTALLHDR _offsetof.h
C++ OSArray.cpo
INSTALLHDR _os_inline.h
C++ IOStatistics.cpo
INSTALLHDR _pid_t.h
INSTALLHDR _posix_vdisable.h
INSTALLHDR _ptrdiff_t.h
INSTALLHDR _rsize_t.h
INSTALLHDR _rune_t.h
CC ktss.o
INSTALLHDR _s_ifmt.h
INSTALLHDR _sa_family_t.h
C++ OSBoolean.cpo
INSTALLHDR _seek_set.h
INSTALLHDR _sigaltstack.h
INSTALLHDR _sigset_t.h
INSTALLHDR _size_t.h
C++ OSCollection.cpo
INSTALLHDR _socklen_t.h
CC ldt.o
INSTALLHDR _ssize_t.h
INSTALLHDR _suseconds_t.h
CC loose_ends.o
INSTALLHDR _time_t.h
INSTALLHDR _timespec.h
C++ OSCollectionIterator.cpo
INSTALLHDR _timeval.h
INSTALLHDR _timeval32.h
INSTALLHDR _ucontext.h
INSTALLHDR _ucontext64.h
INSTALLHDR _uid_t.h
C++ OSData.cpo
INSTALLHDR _uintptr_t.h
INSTALLHDR _useconds_t.h
INSTALLHDR _uuid_t.h
INSTALLHDR _va_list.h
C++ OSDictionary.cpo
INSTALLHDR _wchar_t.h
INSTALLHDR _wint_t.h
INSTALLHDR _blkcnt_t.h
INSTALLHDR _blksize_t.h
CC copyio.o
INSTALLHDR _clock_t.h
INSTALLHDR _ct_rune_t.h
INSTALLHDR _dev_t.h
C++ OSIterator.cpo
INSTALLHDR _errno_t.h
INSTALLHDR _fd_clr.h
C++ OSKext.cpo
INSTALLHDR _fd_copy.h
INSTALLHDR _fd_def.h
INSTALLHDR _fd_isset.h
INSTALLHDR _fd_set.h
INSTALLHDR _fd_setsize.h
INSTALLHDR _fd_zero.h
INSTALLHDR _filesec_t.h
CC locks_i386.o
INSTALLHDR _fsblkcnt_t.h
INSTALLHDR _fsfilcnt_t.h
INSTALLHDR _fsid_t.h
INSTALLHDR _gid_t.h
INSTALLHDR _guid_t.h
INSTALLHDR _id_t.h
INSTALLHDR _in_addr_t.h
C++ IOInterruptAccounting.cpo
INSTALLHDR _in_port_t.h
INSTALLHDR _ino64_t.h
INSTALLHDR _ino_t.h
INSTALLHDR _int16_t.h
INSTALLHDR _int32_t.h
INSTALLHDR _int64_t.h
INSTALLHDR _int8_t.h
INSTALLHDR _intptr_t.h
C++ IOReporter.cpo
INSTALLHDR _iovec_t.h
CC lowmem_vectors.o
INSTALLHDR _key_t.h
INSTALLHDR _mach_port_t.h
INSTALLHDR _mbstate_t.h
INSTALLHDR _mode_t.h
CC machine_routines.o
INSTALLHDR _nlink_t.h
INSTALLHDR _null.h
INSTALLHDR _o_dsync.h
CC kern_exit.o
INSTALLHDR _o_sync.h
INSTALLHDR _off_t.h
INSTALLHDR _offsetof.h
INSTALLHDR _os_inline.h
INSTALLHDR _pid_t.h
C++ IOSimpleReporter.cpo
INSTALLHDR _posix_vdisable.h
INSTALLHDR _ptrdiff_t.h
INSTALLHDR _rsize_t.h
INSTALLHDR _rune_t.h
INSTALLHDR _s_ifmt.h
INSTALLHDR _sa_family_t.h
INSTALLHDR _seek_set.h
INSTALLHDR _sigaltstack.h
C++ IOStateReporter.cpo
INSTALLHDR _sigset_t.h
CC machine_check.o
INSTALLHDR _size_t.h
INSTALLHDR _socklen_t.h
INSTALLHDR _ssize_t.h
INSTALLHDR _suseconds_t.h
INSTALLHDR _time_t.h
INSTALLHDR _timespec.h
INSTALLHDR _timeval.h
INSTALLHDR _timeval32.h
INSTALLHDR _ucontext.h
CC machine_task.o
INSTALLHDR _ucontext64.h
INSTALLHDR _uid_t.h
INSTALLHDR _uintptr_t.h
C++ IOHistogramReporter.cpo
INSTALLHDR _useconds_t.h
INSTALLHDR _uuid_t.h
C++ OSNumber.cpo
INSTALLHDR _va_list.h
INSTALLHDR _wchar_t.h
INSTALLHDR _wint_t.h
INSTALLHDR _user_timespec.h
INSTALLHDR _user64_timespec.h
CC pcb.o
C++ OSOrderedSet.cpo
INSTALLHDR _user32_timespec.h
INSTALLHDR _user_timeval.h
INSTALLHDR _user64_timeval.h
INSTALLHDR _user32_timeval.h
INSTALLHDR _user64_itimerval.h
CC kern_lockf.o
INSTALLHDR _user32_itimerval.h
C++ OSRuntime.cpo
C++ IOReportLegend.cpo
Generating bsd/sys/_posix_availability.h
Generating bsd/sys/_symbol_aliasing.h
AS OSAtomic.o
CC IOStringFuncs.o
LDFILELIST libkern
INSTALLHDR asm.h
C++ KernelConfigTables.cpo
INSTALLHDR boolean.h
C++ IOKitBSDInit.cpo
INSTALLHDR exception.h
INSTALLHDR appleapiopts.h
INSTALLHDR kern_return.h
INSTALLHDR acct.h
INSTALLHDR ndr_def.h
INSTALLHDR aio.h
INSTALLHDR rpc.h
INSTALLHDR attr.h
INSTALLHDR processor_info.h
INSTALLHDR buf.h
INSTALLHDR thread_state.h
INSTALLHDR cdefs.h
INSTALLHDR thread_status.h
INSTALLHDR conf.h
CC kern_fork.o
INSTALLHDR vm_param.h
INSTALLHDR dir.h
INSTALLHDR vm_types.h
INSTALLHDR machine_types.defs
INSTALLHDR dirent.h
INSTALLHDR syscall_sw.h
INSTALLHDR disk.h
INSTALLHDR sdt.h
INSTALLHDR dkstat.h
INSTALLHDR sdt_isa.h
INSTALLHDR dtrace.h
INSTALLHDR asm.h
INSTALLHDR dtrace_glue.h
INSTALLHDR boolean.h
CC pcb_native.o
INSTALLHDR dtrace_impl.h
C++ DINetBootHook.cpo
INSTALLHDR exception.h
INSTALLHDR errno.h
INSTALLHDR kern_return.h
INSTALLHDR ev.h
INSTALLHDR ndr_def.h
INSTALLHDR event.h
INSTALLHDR rpc.h
INSTALLHDR fasttrap.h
INSTALLHDR processor_info.h
INSTALLHDR fasttrap_isa.h
INSTALLHDR thread_state.h
INSTALLHDR fcntl.h
INSTALLHDR thread_status.h
INSTALLHDR file.h
INSTALLHDR vm_param.h
INSTALLHDR filedesc.h
INSTALLHDR vm_types.h
INSTALLHDR filio.h
INSTALLHDR machine_types.defs
INSTALLHDR gmon.h
INSTALLHDR syscall_sw.h
INSTALLHDR ioccom.h
INSTALLHDR sdt.h
INSTALLHDR ioctl.h
INSTALLHDR sdt_isa.h
C++ RootDomainUserClient.cpo
INSTALLHDR ioctl_compat.h
INSTALLHDR asm.h
INSTALLHDR ipc.h
INSTALLHDR boolean.h
INSTALLHDR kernel.h
INSTALLHDR exception.h
INSTALLHDR kernel_types.h
INSTALLHDR kern_return.h
INSTALLHDR kern_event.h
CC phys.o
INSTALLHDR ndr_def.h
INSTALLHDR loadable_fs.h
INSTALLHDR rpc.h
INSTALLHDR lock.h
INSTALLHDR processor_info.h
INSTALLHDR lockf.h
INSTALLHDR thread_state.h
INSTALLHDR kauth.h
INSTALLHDR thread_status.h
INSTALLHDR kdebug.h
INSTALLHDR vm_param.h
INSTALLHDR kern_control.h
INSTALLHDR vm_types.h
INSTALLHDR lctx.h
INSTALLHDR machine_types.defs
INSTALLHDR lockstat.h
INSTALLHDR syscall_sw.h
INSTALLHDR malloc.h
INSTALLHDR sdt.h
INSTALLHDR mbuf.h
INSTALLHDR sdt_isa.h
CC kern_asl.o
INSTALLHDR mman.h
INSTALLHDR asm.h
CC rtclock.o
INSTALLHDR mount.h
INSTALLHDR boolean.h
INSTALLHDR exception.h
INSTALLHDR msg.h
INSTALLHDR msgbuf.h
INSTALLHDR kern_return.h
INSTALLHDR ndr_def.h
INSTALLHDR netport.h
INSTALLHDR param.h
INSTALLHDR rpc.h
INSTALLHDR processor_info.h
INSTALLHDR paths.h
C++ IOPowerConnection.cpo
INSTALLHDR thread_state.h
INSTALLHDR pipe.h
INSTALLHDR thread_status.h
INSTALLHDR poll.h
INSTALLHDR vm_param.h
INSTALLHDR proc.h
INSTALLHDR vm_types.h
INSTALLHDR proc_info.h
INSTALLHDR machine_types.defs
INSTALLHDR ptrace.h
INSTALLHDR syscall_sw.h
INSTALLHDR queue.h
INSTALLHDR sdt.h
CC kern_malloc.o
INSTALLHDR quota.h
INSTALLHDR sdt_isa.h
INSTALLHDR random.h
INSTALLHDR reboot.h
CC rtclock_native.o
INSTALLHDR resource.h
INSTALLHDR resourcevar.h
C++ IOWatchDogTimer.cpo
INSTALLHDR sbuf.h
INSTALLHDR bootstrap.h
INSTALLHDR posix_sem.h
INSTALLHDR boolean.h
INSTALLHDR posix_shm.h
INSTALLHDR clock_types.h
INSTALLHDR sdt.h
INSTALLHDR error.h
INSTALLHDR select.h
INSTALLHDR exception.h
INSTALLHDR sem.h
INSTALLHDR exception_types.h
CC trap.o
INSTALLHDR semaphore.h
INSTALLHDR host_notify.h
INSTALLHDR shm.h
INSTALLHDR host_info.h
INSTALLHDR signal.h
INSTALLHDR host_reboot.h
INSTALLHDR signalvar.h
INSTALLHDR host_special_ports.h
INSTALLHDR socket.h
INSTALLHDR kern_return.h
INSTALLHDR socketvar.h
INSTALLHDR kmod.h
INSTALLHDR sockio.h
INSTALLHDR mach_param.h
INSTALLHDR stat.h
INSTALLHDR mach_time.h
INSTALLHDR mach_traps.h
INSTALLHDR stdio.h
INSTALLHDR sysctl.h
INSTALLHDR mach_types.h
INSTALLHDR mach_voucher_types.h
INSTALLHDR syslimits.h
C++ IOSyncer.cpo
INSTALLHDR machine.h
INSTALLHDR syslog.h
INSTALLHDR sys_domain.h
INSTALLHDR mach_syscalls.h
INSTALLHDR termios.h
INSTALLHDR memory_object_types.h
INSTALLHDR time.h
INSTALLHDR message.h
INSTALLHDR timeb.h
INSTALLHDR mig.h
INSTALLHDR times.h
INSTALLHDR mig_errors.h
INSTALLHDR tprintf.h
INSTALLHDR mig_voucher_support.h
C++ IOPMrootDomain.cpo
CC kern_mman.o
INSTALLHDR trace.h
INSTALLHDR ndr.h
INSTALLHDR notify.h
INSTALLHDR tty.h
INSTALLHDR ttychars.h
INSTALLHDR policy.h
INSTALLHDR ttycom.h
INSTALLHDR port.h
INSTALLHDR processor_info.h
INSTALLHDR ttydefaults.h
INSTALLHDR rpc.h
INSTALLHDR ttydev.h
INSTALLHDR types.h
INSTALLHDR sdt.h
INSTALLHDR semaphore.h
INSTALLHDR ubc.h
CC trap_native.o
INSTALLHDR shared_memory_server.h
INSTALLHDR ucontext.h
INSTALLHDR ucred.h
INSTALLHDR shared_region.h
INSTALLHDR uio.h
INSTALLHDR std_types.h
INSTALLHDR un.h
INSTALLHDR sync_policy.h
INSTALLHDR unistd.h
INSTALLHDR syscall_sw.h
INSTALLHDR unpcb.h
INSTALLHDR task_info.h
INSTALLHDR user.h
INSTALLHDR task_policy.h
INSTALLHDR utfconv.h
INSTALLHDR task_special_ports.h
INSTALLHDR utsname.h
INSTALLHDR thread_info.h
INSTALLHDR vadvise.h
INSTALLHDR thread_policy.h
INSTALLHDR vcmd.h
INSTALLHDR thread_special_ports.h
CC user_ldt.o
INSTALLHDR vm.h
INSTALLHDR thread_status.h
INSTALLHDR vmmeter.h
INSTALLHDR thread_switch.h
INSTALLHDR vmparam.h
INSTALLHDR time_value.h
INSTALLHDR vnioctl.h
INSTALLHDR vm_attributes.h
INSTALLHDR vnode.h
INSTALLHDR vm_behavior.h
INSTALLHDR vm_inherit.h
INSTALLHDR vnode_if.h
INSTALLHDR vm_param.h
INSTALLHDR vstat.h
INSTALLHDR vm_prot.h
INSTALLHDR wait.h
INSTALLHDR vm_purgable.h
INSTALLHDR xattr.h
INSTALLHDR vm_region.h
INSTALLHDR _select.h
CC Diagnostics.o
INSTALLHDR vm_statistics.h
INSTALLHDR _structs.h
INSTALLHDR vm_sync.h
INSTALLHDR _types.h
CC kern_physio.o
INSTALLHDR vm_types.h
INSTALLHDR _endian.h
INSTALLHDR clock_types.defs
INSTALLHDR domain.h
INSTALLHDR mach_types.defs
INSTALLHDR protosw.h
INSTALLHDR std_types.defs
INSTALLHDR spawn.h
INSTALLHDR syscall.h
INSTALLHDR audit_triggers.defs
INSTALLHDR _posix_availability.h
INSTALLHDR clock.defs
INSTALLHDR clock_priv.defs
INSTALLHDR _symbol_aliasing.h
INSTALLHDR clock_reply.defs
INSTALLHDR appleapiopts.h
CC kern_priv.o
INSTALLHDR exc.defs
INSTALLHDR attr.h
INSTALLHDR host_notify_reply.defs
INSTALLHDR buf.h
INSTALLHDR host_priv.defs
INSTALLHDR cdefs.h
INSTALLHDR host_security.defs
INSTALLHDR conf.h
CC pmCPU.o
INSTALLHDR lock_set.defs
INSTALLHDR dir.h
INSTALLHDR mach_exc.defs
INSTALLHDR dirent.h
INSTALLHDR mach_host.defs
INSTALLHDR disk.h
CC kern_proc.o
INSTALLHDR mach_port.defs
INSTALLHDR disklabel.h
INSTALLHDR mach_vm.defs
INSTALLHDR dkstat.h
INSTALLHDR mach_voucher.defs
INSTALLHDR errno.h
INSTALLHDR mach_voucher_attr_control.defs
INSTALLHDR ev.h
INSTALLHDR notify.defs
INSTALLHDR event.h
INSTALLHDR processor.defs
INSTALLHDR fcntl.h
INSTALLHDR processor_set.defs
INSTALLHDR file.h
INSTALLHDR task.defs
INSTALLHDR filio.h
INSTALLHDR task_access.defs
INSTALLHDR ioccom.h
INSTALLHDR telemetry_notification.defs
INSTALLHDR ioctl.h
INSTALLHDR thread_act.defs
INSTALLHDR ipc.h
INSTALLHDR vm_map.defs
INSTALLHDR ioctl_compat.h
INSTALLHDR mach_interface.h
INSTALLHDR boolean.h
INSTALLHDR kernel.h
INSTALLHDR clock_types.h
INSTALLHDR kernel_types.h
CC tsc.o
INSTALLHDR error.h
INSTALLHDR kern_event.h
INSTALLHDR exception.h
INSTALLHDR lctx.h
INSTALLHDR exception_types.h
INSTALLHDR lock.h
INSTALLHDR host_notify.h
INSTALLHDR lockf.h
INSTALLHDR host_info.h
INSTALLHDR kauth.h
INSTALLHDR host_reboot.h
INSTALLHDR kdebug.h
INSTALLHDR host_special_ports.h
INSTALLHDR md5.h
INSTALLHDR kern_return.h
INSTALLHDR kern_control.h
INSTALLHDR kmod.h
INSTALLHDR imgact.h
INSTALLHDR mach_param.h
INSTALLHDR malloc.h
INSTALLHDR mach_time.h
INSTALLHDR namei.h
C++ IntelClock.cpo
INSTALLHDR mach_types.h
INSTALLHDR mman.h
INSTALLHDR mach_voucher_types.h
INSTALLHDR mbuf.h
INSTALLHDR machine.h
INSTALLHDR mount.h
INSTALLHDR memory_object_types.h
CC commpage.o
INSTALLHDR netport.h
INSTALLHDR message.h
INSTALLHDR param.h
INSTALLHDR mig.h
INSTALLHDR paths.h
INSTALLHDR mig_errors.h
INSTALLHDR proc.h
INSTALLHDR mig_voucher_support.h
INSTALLHDR queue.h
INSTALLHDR ndr.h
INSTALLHDR random.h
INSTALLHDR notify.h
INSTALLHDR resource.h
INSTALLHDR policy.h
C++ IOKeyStoreHelper.cpo
INSTALLHDR sbuf.h
INSTALLHDR port.h
INSTALLHDR posix_sem.h
INSTALLHDR processor_info.h
INSTALLHDR posix_shm.h
INSTALLHDR rpc.h
INSTALLHDR sem.h
INSTALLHDR sdt.h
INSTALLHDR shm.h
INSTALLHDR semaphore.h
INSTALLHDR select.h
INSTALLHDR shared_memory_server.h
CC conf.o
C++ IOHibernateIO.cpo
INSTALLHDR signal.h
INSTALLHDR shared_region.h
INSTALLHDR socket.h
INSTALLHDR std_types.h
INSTALLHDR socketvar.h
INSTALLHDR sync_policy.h
INSTALLHDR sockio.h
INSTALLHDR syscall_sw.h
CC model_dep.o
INSTALLHDR task_info.h
INSTALLHDR stat.h
INSTALLHDR task_policy.h
INSTALLHDR stdio.h
INSTALLHDR sysctl.h
INSTALLHDR task_special_ports.h
INSTALLHDR thread_info.h
INSTALLHDR syslimits.h
INSTALLHDR thread_policy.h
INSTALLHDR syslog.h
INSTALLHDR thread_special_ports.h
INSTALLHDR systm.h
INSTALLHDR thread_status.h
INSTALLHDR sys_domain.h
INSTALLHDR time_value.h
INSTALLHDR time.h
INSTALLHDR vm_attributes.h
INSTALLHDR types.h
INSTALLHDR vm_behavior.h
INSTALLHDR ubc.h
INSTALLHDR vm_inherit.h
INSTALLHDR ucontext.h
INSTALLHDR vm_param.h
INSTALLHDR ucred.h
INSTALLHDR vm_prot.h
INSTALLHDR uio.h
INSTALLHDR vm_purgable.h
INSTALLHDR un.h
INSTALLHDR vm_region.h
INSTALLHDR unistd.h
INSTALLHDR vm_statistics.h
INSTALLHDR unpcb.h
INSTALLHDR vm_sync.h
INSTALLHDR utfconv.h
INSTALLHDR vm_types.h
INSTALLHDR vm.h
INSTALLHDR clock_types.defs
INSTALLHDR vmparam.h
INSTALLHDR mach_types.defs
INSTALLHDR vnode.h
INSTALLHDR std_types.defs
INSTALLHDR vnode_if.h
INSTALLHDR audit_triggers.defs
INSTALLHDR xattr.h
INSTALLHDR clock.defs
INSTALLHDR _select.h
CC lapic.o
INSTALLHDR clock_priv.defs
INSTALLHDR _structs.h
INSTALLHDR clock_reply.defs
INSTALLHDR _types.h
INSTALLHDR exc.defs
INSTALLHDR _endian.h
CC kern_prot.o
INSTALLHDR host_notify_reply.defs
INSTALLHDR protosw.h
INSTALLHDR host_priv.defs
INSTALLHDR domain.h
INSTALLHDR host_security.defs
INSTALLHDR kpi_mbuf.h
INSTALLHDR lock_set.defs
INSTALLHDR kpi_socket.h
CC lapic_native.o
INSTALLHDR mach_exc.defs
INSTALLHDR kpi_socketfilter.h
INSTALLHDR mach_host.defs
INSTALLHDR ttycom.h
INSTALLHDR mach_port.defs
INSTALLHDR termios.h
INSTALLHDR mach_vm.defs
INSTALLHDR msg.h
INSTALLHDR mach_voucher.defs
INSTALLHDR wait.h
INSTALLHDR mach_voucher_attr_control.defs
INSTALLHDR spawn.h
INSTALLHDR notify.defs
INSTALLHDR syscall.h
INSTALLHDR processor.defs
INSTALLHDR sysproto.h
INSTALLHDR processor_set.defs
INSTALLHDR appleapiopts.h
INSTALLHDR task.defs
INSTALLHDR acct.h
INSTALLHDR task_access.defs
INSTALLHDR telemetry_notification.defs
INSTALLHDR aio.h
INSTALLHDR thread_act.defs
INSTALLHDR attr.h
INSTALLHDR vm_map.defs
INSTALLHDR buf.h
INSTALLHDR clock.h
INSTALLHDR cdefs.h
INSTALLHDR clock_priv.h
INSTALLHDR conf.h
INSTALLHDR host_priv.h
INSTALLHDR dir.h
INSTALLHDR dirent.h
INSTALLHDR host_security.h
INSTALLHDR disk.h
INSTALLHDR lock_set.h
CC IOHibernateRestoreKernel.o
INSTALLHDR dkstat.h
INSTALLHDR mach_host.h
CC mp.o
INSTALLHDR dtrace.h
INSTALLHDR mach_port.h
INSTALLHDR dtrace_glue.h
INSTALLHDR mach_vm.h
CC kern_resource.o
INSTALLHDR dtrace_impl.h
INSTALLHDR mach_voucher.h
INSTALLHDR mach_voucher_attr_control.h
INSTALLHDR errno.h
INSTALLHDR memory_object_control.h
INSTALLHDR ev.h
INSTALLHDR processor.h
INSTALLHDR event.h
INSTALLHDR processor_set.h
INSTALLHDR fasttrap.h
INSTALLHDR task.h
INSTALLHDR fasttrap_isa.h
INSTALLHDR fcntl.h
INSTALLHDR task_access.h
INSTALLHDR thread_act.h
INSTALLHDR file.h
INSTALLHDR filedesc.h
INSTALLHDR upl.h
INSTALLHDR filio.h
INSTALLHDR vm_map.h
INSTALLHDR gmon.h
INSTALLHDR audit_triggers_server.h
INSTALLHDR ioccom.h
INSTALLHDR clock_reply_server.h
INSTALLHDR ioctl.h
INSTALLHDR coalition_notification_server.h
INSTALLHDR exc_server.h
INSTALLHDR ioctl_compat.h
INSTALLHDR ipc.h
INSTALLHDR mach_exc_server.h
INSTALLHDR kernel.h
INSTALLHDR memory_object_server.h
INSTALLHDR kernel_types.h
INSTALLHDR memory_object_default_server.h
INSTALLHDR kern_event.h
INSTALLHDR notify_server.h
INSTALLHDR loadable_fs.h
INSTALLHDR task_access_server.h
INSTALLHDR lock.h
INSTALLHDR telemetry_notification_server.h
INSTALLHDR lockf.h
INSTALLHDR bootstrap.h
INSTALLHDR kauth.h
INSTALLHDR sfi_class.h
INSTALLHDR kdebug.h
INSTALLHDR coalition_notification.defs
INSTALLHDR kern_control.h
INSTALLHDR boolean.h
AS IOSharedLock.o
INSTALLHDR lctx.h
INSTALLHDR clock_types.h
AS IOAsmSupport.o
INSTALLHDR lockstat.h
INSTALLHDR error.h
INSTALLHDR malloc.h
INSTALLHDR exception.h
LDFILELIST iokit
INSTALLHDR mbuf.h
INSTALLHDR exception_types.h
INSTALLHDR mman.h
INSTALLHDR host_notify.h
INSTALLHDR mount.h
INSTALLHDR host_info.h
INSTALLHDR uuid.h
INSTALLHDR host_reboot.h
INSTALLHDR msg.h
INSTALLHDR uuid.h
INSTALLHDR host_special_ports.h
INSTALLHDR msgbuf.h
INSTALLHDR uuid.h
INSTALLHDR netport.h
INSTALLHDR kern_return.h
INSTALLHDR uuid.h
INSTALLHDR param.h
INSTALLHDR kmod.h
CC mp_native.o
INSTALLHDR paths.h
INSTALLHDR mach_param.h
INSTALLHDR pipe.h
INSTALLHDR mach_time.h
INSTALLHDR poll.h
INSTALLHDR mach_traps.h
INSTALLHDR vfs_support.h
INSTALLHDR proc.h
INSTALLHDR mach_types.h
INSTALLHDR vfs_support.h
INSTALLHDR proc_info.h
INSTALLHDR mach_voucher_types.h
INSTALLHDR vfs_support.h
INSTALLHDR machine.h
INSTALLHDR ptrace.h
INSTALLHDR vfs_support.h
CC kern_shutdown.o
INSTALLHDR mach_syscalls.h
INSTALLHDR queue.h
INSTALLHDR quota.h
INSTALLHDR memory_object_types.h
CC acpi.o
INSTALLHDR random.h
INSTALLHDR message.h
INSTALLHDR boot.h
INSTALLHDR reboot.h
INSTALLHDR mig.h
INSTALLHDR protos.h
INSTALLHDR resource.h
INSTALLHDR mig_errors.h
INSTALLHDR boot.h
INSTALLHDR resourcevar.h
INSTALLHDR mig_voucher_support.h
INSTALLHDR protos.h
INSTALLHDR sbuf.h
INSTALLHDR ndr.h
INSTALLHDR boot.h
INSTALLHDR posix_sem.h
INSTALLHDR notify.h
INSTALLHDR protos.h
INSTALLHDR posix_shm.h
INSTALLHDR policy.h
INSTALLHDR boot.h
INSTALLHDR sdt.h
INSTALLHDR port.h
INSTALLHDR protos.h
INSTALLHDR select.h
INSTALLHDR processor_info.h
INSTALLHDR sem.h
INSTALLHDR rpc.h
INSTALLHDR semaphore.h
INSTALLHDR sdt.h
INSTALLHDR boot.h
INSTALLHDR shm.h
INSTALLHDR semaphore.h
INSTALLHDR protos.h
INSTALLHDR signal.h
INSTALLHDR shared_memory_server.h
CC mtrr.o
INSTALLHDR pexpert.h
INSTALLHDR signalvar.h
INSTALLHDR shared_region.h
INSTALLHDR boot.h
INSTALLHDR socket.h
INSTALLHDR std_types.h
INSTALLHDR protos.h
INSTALLHDR socketvar.h
INSTALLHDR sync_policy.h
INSTALLHDR pexpert.h
INSTALLHDR syscall_sw.h
INSTALLHDR sockio.h
INSTALLHDR device_tree.h
INSTALLHDR task_info.h
INSTALLHDR stat.h
INSTALLHDR boot.h
INSTALLHDR task_policy.h
INSTALLHDR stdio.h
INSTALLHDR protos.h
CC kern_sig.o
INSTALLHDR sysctl.h
INSTALLHDR task_special_ports.h
INSTALLHDR pexpert.h
INSTALLHDR syslimits.h
INSTALLHDR thread_info.h
INSTALLHDR boot.h
INSTALLHDR syslog.h
INSTALLHDR thread_policy.h
INSTALLHDR protos.h
INSTALLHDR pexpert.h
INSTALLHDR sys_domain.h
INSTALLHDR thread_special_ports.h
INSTALLHDR thread_status.h
INSTALLHDR termios.h
INSTALLHDR device_tree.h
INSTALLHDR thread_switch.h
INSTALLHDR time.h
INSTALLHDR time_value.h
INSTALLHDR timeb.h
INSTALLHDR vm_attributes.h
INSTALLHDR times.h
CC serial_console.o
INSTALLHDR vm_behavior.h
INSTALLHDR tprintf.h
INSTALLHDR vm_inherit.h
INSTALLHDR trace.h
INSTALLHDR vm_param.h
INSTALLHDR tty.h
C++ bootstrap.cpo
INSTALLHDR vm_prot.h
INSTALLHDR ttychars.h
INSTALLHDR vm_purgable.h
INSTALLHDR ttycom.h
INSTALLHDR vm_region.h
INSTALLHDR ttydefaults.h
INSTALLHDR vm_statistics.h
INSTALLHDR ttydev.h
INSTALLHDR vm_sync.h
INSTALLHDR types.h
INSTALLHDR vm_types.h
INSTALLHDR ubc.h
INSTALLHDR clock_types.defs
INSTALLHDR ucontext.h
CC video_console.o
INSTALLHDR mach_types.defs
INSTALLHDR ucred.h
INSTALLHDR std_types.defs
INSTALLHDR uio.h
INSTALLHDR audit_triggers.defs
INSTALLHDR un.h
INSTALLHDR clock.defs
INSTALLHDR unistd.h
INSTALLHDR clock_priv.defs
INSTALLHDR unpcb.h
INSTALLHDR clock_reply.defs
INSTALLHDR user.h
INSTALLHDR exc.defs
INSTALLHDR utfconv.h
INSTALLHDR host_notify_reply.defs
INSTALLHDR utsname.h
INSTALLHDR host_priv.defs
INSTALLHDR vadvise.h
INSTALLHDR vcmd.h
INSTALLHDR host_security.defs
INSTALLHDR vm.h
LDFILELIST libsa
INSTALLHDR lock_set.defs
INSTALLHDR vmmeter.h
INSTALLHDR mach_exc.defs
INSTALLHDR vmparam.h
INSTALLHDR mach_host.defs
INSTALLHDR vnioctl.h
INSTALLHDR mach_port.defs
INSTALLHDR vnode.h
INSTALLHDR OSByteOrder.h
INSTALLHDR mach_vm.defs
INSTALLHDR vnode_if.h
INSTALLHDR OSByteOrder.h
INSTALLHDR mach_voucher.defs
INSTALLHDR vstat.h
INSTALLHDR OSByteOrder.h
INSTALLHDR mach_voucher_attr_control.defs
INSTALLHDR wait.h
INSTALLHDR OSByteOrder.h
INSTALLHDR notify.defs
INSTALLHDR xattr.h
INSTALLHDR processor.defs
INSTALLHDR _select.h
INSTALLHDR processor_set.defs
INSTALLHDR OSArray.h
INSTALLHDR _structs.h
INSTALLHDR task.defs
INSTALLHDR OSBoolean.h
INSTALLHDR _types.h
INSTALLHDR task_access.defs
INSTALLHDR OSCollection.h
INSTALLHDR _endian.h
INSTALLHDR telemetry_notification.defs
INSTALLHDR OSCollectionIterator.h
INSTALLHDR domain.h
INSTALLHDR thread_act.defs
INSTALLHDR OSContainers.h
INSTALLHDR protosw.h
INSTALLHDR vm_map.defs
INSTALLHDR OSCPPDebug.h
INSTALLHDR spawn.h
INSTALLHDR mach_interface.h
INSTALLHDR OSData.h
INSTALLHDR coalition.h
INSTALLHDR boolean.h
INSTALLHDR OSDictionary.h
INSTALLHDR codesign.h
INSTALLHDR clock_types.h
INSTALLHDR OSEndianTypes.h
INSTALLHDR content_protection.h
INSTALLHDR error.h
INSTALLHDR OSIterator.h
INSTALLHDR csr.h
INSTALLHDR exception.h
INSTALLHDR OSKext.h
INSTALLHDR decmpfs.h
INSTALLHDR exception_types.h
INSTALLHDR OSLib.h
INSTALLHDR disklabel.h
INSTALLHDR host_notify.h
INSTALLHDR OSMetaClass.h
INSTALLHDR host_info.h
INSTALLHDR fileport.h
INSTALLHDR OSNumber.h
INSTALLHDR fsctl.h
INSTALLHDR host_reboot.h
INSTALLHDR OSObject.h
INSTALLHDR host_special_ports.h
INSTALLHDR fsgetpath.h
INSTALLHDR OSOrderedSet.h
INSTALLHDR kern_return.h
INSTALLHDR fslog.h
CC kern_subr.o
INSTALLHDR OSSerialize.h
INSTALLHDR guarded.h
INSTALLHDR kmod.h
INSTALLHDR OSSet.h
INSTALLHDR imgsrc.h
INSTALLHDR mach_param.h
INSTALLHDR OSString.h
INSTALLHDR ipcs.h
INSTALLHDR mach_time.h
INSTALLHDR kas_info.h
INSTALLHDR OSSymbol.h
INSTALLHDR mach_types.h
INSTALLHDR kern_memorystatus.h
INSTALLHDR mach_voucher_types.h
INSTALLHDR OSUnserialize.h
INSTALLHDR kern_overrides.h
INSTALLHDR machine.h
INSTALLHDR OSArray.h
INSTALLHDR sfi.h
INSTALLHDR memory_object_types.h
INSTALLHDR OSBoolean.h
INSTALLHDR shm_internal.h
INSTALLHDR OSCollection.h
INSTALLHDR message.h
INSTALLHDR spawn_internal.h
INSTALLHDR OSCollectionIterator.h
INSTALLHDR mig.h
INSTALLHDR tree.h
INSTALLHDR OSContainers.h
INSTALLHDR mig_errors.h
INSTALLHDR ux_exception.h
INSTALLHDR OSCPPDebug.h
INSTALLHDR mig_voucher_support.h
INSTALLHDR process_policy.h
INSTALLHDR OSData.h
INSTALLHDR ndr.h
INSTALLHDR proc_uuid_policy.h
INSTALLHDR OSDictionary.h
INSTALLHDR notify.h
INSTALLHDR priv.h
INSTALLHDR OSEndianTypes.h
INSTALLHDR policy.h
INSTALLHDR syscall.h
INSTALLHDR OSIterator.h
INSTALLHDR port.h
INSTALLHDR _posix_availability.h
INSTALLHDR OSKext.h
INSTALLHDR processor_info.h
INSTALLHDR _symbol_aliasing.h
INSTALLHDR OSLib.h
INSTALLHDR rpc.h
INSTALLHDR appleapiopts.h
INSTALLHDR OSMetaClass.h
INSTALLHDR sdt.h
INSTALLHDR attr.h
INSTALLHDR semaphore.h
INSTALLHDR OSNumber.h
INSTALLHDR buf.h
CC kern_synch.o
INSTALLHDR shared_memory_server.h
INSTALLHDR OSObject.h
INSTALLHDR cdefs.h
INSTALLHDR shared_region.h
INSTALLHDR OSOrderedSet.h
INSTALLHDR conf.h
INSTALLHDR std_types.h
INSTALLHDR OSSerialize.h
INSTALLHDR dir.h
INSTALLHDR sync_policy.h
INSTALLHDR OSSet.h
INSTALLHDR dirent.h
INSTALLHDR OSString.h
INSTALLHDR syscall_sw.h
INSTALLHDR disk.h
INSTALLHDR OSSymbol.h
INSTALLHDR task_info.h
INSTALLHDR disklabel.h
INSTALLHDR OSUnserialize.h
INSTALLHDR task_policy.h
INSTALLHDR dkstat.h
INSTALLHDR errno.h
INSTALLHDR task_special_ports.h
INSTALLHDR ev.h
INSTALLHDR thread_info.h
INSTALLHDR md5.h
INSTALLHDR thread_policy.h
INSTALLHDR sha1.h
INSTALLHDR event.h
CC kern_sysctl.o
INSTALLHDR thread_special_ports.h
INSTALLHDR register_crypto.h
INSTALLHDR fcntl.h
INSTALLHDR file.h
INSTALLHDR thread_status.h
INSTALLHDR sha2.h
INSTALLHDR filio.h
INSTALLHDR time_value.h
INSTALLHDR des.h
INSTALLHDR ioccom.h
INSTALLHDR vm_attributes.h
INSTALLHDR aes.h
INSTALLHDR ioctl.h
INSTALLHDR vm_behavior.h
INSTALLHDR aesxts.h
INSTALLHDR vm_inherit.h
INSTALLHDR ipc.h
INSTALLHDR ioctl_compat.h
INSTALLHDR vm_param.h
INSTALLHDR kernel.h
INSTALLHDR vm_prot.h
INSTALLHDR OSByteOrder.h
INSTALLHDR kernel_types.h
INSTALLHDR vm_purgable.h
INSTALLHDR kern_event.h
INSTALLHDR _OSByteOrder.h
INSTALLHDR vm_region.h
CC video_scroll.o
INSTALLHDR lctx.h
INSTALLHDR OSDebug.h
INSTALLHDR vm_statistics.h
INSTALLHDR lock.h
INSTALLHDR OSKextLib.h
INSTALLHDR vm_sync.h
INSTALLHDR lockf.h
INSTALLHDR vm_types.h
INSTALLHDR OSReturn.h
INSTALLHDR kauth.h
INSTALLHDR clock_types.defs
CC kdp_machdep.o
INSTALLHDR OSTypes.h
INSTALLHDR kdebug.h
INSTALLHDR OSAtomic.h
INSTALLHDR mach_types.defs
INSTALLHDR md5.h
INSTALLHDR std_types.defs
INSTALLHDR OSBase.h
INSTALLHDR kern_control.h
INSTALLHDR audit_triggers.defs
INSTALLHDR OSByteOrder.h
INSTALLHDR imgact.h
INSTALLHDR clock.defs
INSTALLHDR _OSByteOrder.h
INSTALLHDR malloc.h
INSTALLHDR clock_priv.defs
INSTALLHDR OSDebug.h
INSTALLHDR namei.h
INSTALLHDR clock_reply.defs
INSTALLHDR OSKextLib.h
INSTALLHDR mman.h
INSTALLHDR exc.defs
INSTALLHDR OSMalloc.h
INSTALLHDR mbuf.h
INSTALLHDR host_notify_reply.defs
INSTALLHDR OSReturn.h
INSTALLHDR mount.h
INSTALLHDR host_priv.defs
INSTALLHDR OSTypes.h
INSTALLHDR netport.h
INSTALLHDR host_security.defs
INSTALLHDR locks.h
INSTALLHDR param.h
INSTALLHDR lock_set.defs
INSTALLHDR sysctl.h
INSTALLHDR paths.h
INSTALLHDR mach_exc.defs
INSTALLHDR tree.h
INSTALLHDR proc.h
INSTALLHDR mach_host.defs
INSTALLHDR zconf.h
INSTALLHDR queue.h
INSTALLHDR mach_port.defs
INSTALLHDR zlib.h
INSTALLHDR mach_vm.defs
INSTALLHDR random.h
INSTALLHDR version.h
INSTALLHDR resource.h
INSTALLHDR mach_voucher.defs
INSTALLHDR OSByteOrder.h
INSTALLHDR mach_voucher_attr_control.defs
INSTALLHDR sbuf.h
INSTALLHDR _OSByteOrder.h
INSTALLHDR notify.defs
INSTALLHDR posix_sem.h
INSTALLHDR OSDebug.h
INSTALLHDR processor.defs
INSTALLHDR posix_shm.h
INSTALLHDR OSKextLib.h
INSTALLHDR processor_set.defs
INSTALLHDR sem.h
CC kdp_vm.o
INSTALLHDR OSReturn.h
INSTALLHDR task.defs
INSTALLHDR shm.h
INSTALLHDR OSTypes.h
INSTALLHDR task_access.defs
INSTALLHDR select.h
INSTALLHDR OSKextLibPrivate.h
INSTALLHDR telemetry_notification.defs
INSTALLHDR signal.h
INSTALLHDR thread_act.defs
INSTALLHDR kext_request_keys.h
INSTALLHDR socket.h
INSTALLHDR mkext.h
INSTALLHDR vm_map.defs
INSTALLHDR socketvar.h
INSTALLHDR prelink.h
INSTALLHDR clock.h
INSTALLHDR sockio.h
INSTALLHDR OSSerializeBinary.h
INSTALLHDR clock_priv.h
INSTALLHDR stat.h
INSTALLHDR tree.h
INSTALLHDR host_priv.h
INSTALLHDR stdio.h
INSTALLHDR kext_panic_report.h
INSTALLHDR host_security.h
INSTALLHDR sysctl.h
INSTALLHDR OSCrossEndian.h
INSTALLHDR lock_set.h
INSTALLHDR syslimits.h
INSTALLHDR OSAtomic.h
INSTALLHDR mach_host.h
INSTALLHDR OSBase.h
INSTALLHDR syslog.h
CC kern_newsysctl.o
INSTALLHDR mach_port.h
INSTALLHDR systm.h
INSTALLHDR OSByteOrder.h
INSTALLHDR mach_vm.h
INSTALLHDR sys_domain.h
INSTALLHDR _OSByteOrder.h
INSTALLHDR mach_voucher.h
CC kdp_x86_common.o
INSTALLHDR time.h
INSTALLHDR OSDebug.h
INSTALLHDR mach_voucher_attr_control.h
INSTALLHDR types.h
INSTALLHDR OSKextLib.h
INSTALLHDR memory_object_control.h
INSTALLHDR ubc.h
INSTALLHDR OSMalloc.h
INSTALLHDR processor.h
INSTALLHDR ucontext.h
INSTALLHDR OSReturn.h
INSTALLHDR processor_set.h
INSTALLHDR ucred.h
INSTALLHDR OSTypes.h
INSTALLHDR task.h
INSTALLHDR uio.h
INSTALLHDR locks.h
INSTALLHDR task_access.h
INSTALLHDR un.h
INSTALLHDR sysctl.h
INSTALLHDR thread_act.h
INSTALLHDR unistd.h
INSTALLHDR tree.h
INSTALLHDR upl.h
INSTALLHDR unpcb.h
INSTALLHDR zconf.h
INSTALLHDR vm_map.h
INSTALLHDR zlib.h
INSTALLHDR utfconv.h
INSTALLHDR audit_triggers_server.h
INSTALLHDR vm.h
INSTALLHDR OSKextLibPrivate.h
INSTALLHDR clock_reply_server.h
INSTALLHDR vmparam.h
INSTALLHDR kext_request_keys.h
INSTALLHDR coalition_notification_server.h
INSTALLHDR vnode.h
INSTALLHDR mkext.h
INSTALLHDR exc_server.h
INSTALLHDR prelink.h
INSTALLHDR vnode_if.h
INSTALLHDR mach_exc_server.h
INSTALLHDR OSSerializeBinary.h
INSTALLHDR xattr.h
INSTALLHDR memory_object_server.h
INSTALLHDR _select.h
INSTALLHDR version.h
INSTALLHDR memory_object_default_server.h
INSTALLHDR _structs.h
INSTALLHDR notify_server.h
INSTALLHDR _types.h
INSTALLHDR task_access_server.h
INSTALLHDR _endian.h
INSTALLHDR atm_types.h
INSTALLHDR telemetry_notification_server.h
INSTALLHDR protosw.h
INSTALLHDR atm_types.defs
INSTALLHDR domain.h
INSTALLHDR atm_notification.defs
INSTALLHDR bank_types.h
INSTALLHDR atm_types.h
INSTALLHDR kpi_mbuf.h
INSTALLHDR bank_types.h
INSTALLHDR atm_types.defs
INSTALLHDR bank_types.h
INSTALLHDR kpi_socket.h
INSTALLHDR atm_notification.defs
INSTALLHDR bank_types.h
INSTALLHDR kpi_socketfilter.h
INSTALLHDR atm_types.h
INSTALLHDR ttycom.h
CC hibernate_i386.o
INSTALLHDR atm_types.defs
INSTALLHDR termios.h
INSTALLHDR atm_notification.defs
INSTALLHDR msg.h
INSTALLHDR atm_types.h
INSTALLHDR mac.h
INSTALLHDR wait.h
INSTALLHDR atm_types.defs
INSTALLHDR mac_policy.h
INSTALLHDR spawn.h
INSTALLHDR atm_notification.defs
INSTALLHDR codesign.h
INSTALLHDR mac.h
INSTALLHDR cprotect.h
INSTALLHDR mac_policy.h
INSTALLHDR content_protection.h
INSTALLHDR device_types.h
INSTALLHDR _label.h
INSTALLHDR csr.h
INSTALLHDR device_port.h
INSTALLHDR mac_alloc.h
INSTALLHDR decmpfs.h
INSTALLHDR device_types.defs
INSTALLHDR mac_data.h
INSTALLHDR disktab.h
INSTALLHDR device.defs
INSTALLHDR mac_framework.h
INSTALLHDR fbt.h
INSTALLHDR device_types.h
INSTALLHDR mac_mach_internal.h
INSTALLHDR fileport.h
INSTALLHDR device_port.h
INSTALLHDR mac_internal.h
INSTALLHDR fsctl.h
INSTALLHDR device_types.defs
INSTALLHDR fslog.h
INSTALLHDR mac.h
CC kern_memorystatus.o
INSTALLHDR device.defs
INSTALLHDR kasl.h
INSTALLHDR mac_policy.h
INSTALLHDR device_types.h
INSTALLHDR kern_memorystatus.h
CC hibernate_restore.o
INSTALLHDR _label.h
INSTALLHDR device_port.h
INSTALLHDR mach_swapon.h
INSTALLHDR mac_alloc.h
INSTALLHDR device_types.defs
INSTALLHDR msgbuf.h
INSTALLHDR mac_data.h
INSTALLHDR device.defs
INSTALLHDR eventvar.h
INSTALLHDR mac_framework.h
INSTALLHDR device_types.h
INSTALLHDR proc_info.h
INSTALLHDR mac_mach_internal.h
INSTALLHDR device_port.h
INSTALLHDR pthread_shims.h
INSTALLHDR mac_internal.h
INSTALLHDR device_types.defs
INSTALLHDR quota.h
INSTALLHDR mac.h
INSTALLHDR device.defs
INSTALLHDR sem_internal.h
INSTALLHDR mac_policy.h
INSTALLHDR shm_internal.h
INSTALLHDR _label.h
INSTALLHDR signalvar.h
INSTALLHDR mac_alloc.h
INSTALLHDR tty.h
INSTALLHDR mac_data.h
INSTALLHDR ttychars.h
INSTALLHDR default_pager_types.h
INSTALLHDR mac_framework.h
INSTALLHDR ttydefaults.h
INSTALLHDR default_pager_alerts.defs
INSTALLHDR mac_mach_internal.h
INSTALLHDR ttydev.h
INSTALLHDR default_pager_object.h
CC chud_osfmk_callback_i386.o
INSTALLHDR mac_internal.h
INSTALLHDR user.h
INSTALLHDR default_pager_types.h
INSTALLHDR vfs_context.h
INSTALLHDR default_pager_alerts.defs
INSTALLHDR vmmeter.h
INSTALLHDR default_pager_object.h
INSTALLHDR spawn_internal.h
INSTALLHDR priv.h
INSTALLHDR default_pager_types.h
INSTALLHDR sysproto.h
INSTALLHDR default_pager_alerts.defs
INSTALLHDR default_pager_object.h
CC mac_alloc.o
INSTALLHDR default_pager_types.h
CC kern_mib.o
INSTALLHDR default_pager_alerts.defs
INSTALLHDR default_pager_object.h
INSTALLHDR mach_debug.h
CC mac_audit.o
INSTALLHDR hash_info.h
INSTALLHDR ipc_info.h
INSTALLHDR vm_info.h
INSTALLHDR zone_info.h
INSTALLHDR page_info.h
INSTALLHDR mach_debug_types.h
CC chud_cpu_i386.o
INSTALLHDR lockgroup_info.h
INSTALLHDR mach_debug_types.defs
INSTALLHDR mach_debug.h
INSTALLHDR hash_info.h
INSTALLHDR ipc_info.h
INSTALLHDR vm_info.h
INSTALLHDR zone_info.h
CC chud_thread_i386.o
INSTALLHDR page_info.h
INSTALLHDR mach_debug_types.h
INSTALLHDR byte_order.h
INSTALLHDR lockgroup_info.h
INSTALLHDR mach_debug_types.defs
INSTALLHDR mach_debug.h
INSTALLHDR fat.h
INSTALLHDR hash_info.h
INSTALLHDR loader.h
CC mac_base.o
INSTALLHDR ipc_info.h
INSTALLHDR nlist.h
INSTALLHDR vm_info.h
INSTALLHDR reloc.h
INSTALLHDR zone_info.h
INSTALLHDR fat.h
INSTALLHDR page_info.h
INSTALLHDR loader.h
INSTALLHDR mach_debug_types.h
INSTALLHDR nlist.h
INSTALLHDR lockgroup_info.h
INSTALLHDR reloc.h
INSTALLHDR mach_debug_types.defs
INSTALLHDR mach_debug.h
INSTALLHDR stdarg.h
INSTALLHDR hash_info.h
INSTALLHDR stdbool.h
CC kpi_mbuf.o
INSTALLHDR ipc_info.h
INSTALLHDR stdint.h
INSTALLHDR vm_info.h
INSTALLHDR stdarg.h
CC ucode.o
INSTALLHDR zone_info.h
INSTALLHDR stdbool.h
INSTALLHDR page_info.h
INSTALLHDR stdint.h
INSTALLHDR mach_debug_types.h
INSTALLHDR lockgroup_info.h
INSTALLHDR mach_debug_types.defs
INSTALLHDR exc_resource.h
INSTALLHDR ecc.h
CC vmx_cpu.o
INSTALLHDR exc_resource.h
INSTALLHDR affinity.h
INSTALLHDR assert.h
INSTALLHDR audit_sessionport.h
INSTALLHDR call_entry.h
INSTALLHDR clock.h
INSTALLHDR ipc_types.h
INSTALLHDR coalition.h
INSTALLHDR ipc_types.h
INSTALLHDR ipc_port.h
INSTALLHDR cpu_number.h
INSTALLHDR ipc_voucher.h
INSTALLHDR cpu_data.h
INSTALLHDR debug.h
CC kern_sfi.o
INSTALLHDR energy_perf.h
INSTALLHDR extmod_statistics.h
INSTALLHDR hv_support.h
INSTALLHDR ipc_mig.h
CC vmx_shims.o
INSTALLHDR ipc_misc.h
INSTALLHDR kalloc.h
INSTALLHDR kext_alloc.h
INSTALLHDR kern_types.h
INSTALLHDR kpc.h
INSTALLHDR ledger.h
INSTALLHDR lock.h
INSTALLHDR locks.h
CC hv_support.o
INSTALLHDR host.h
INSTALLHDR mach_param.h
INSTALLHDR macro_help.h
INSTALLHDR cpu_capabilities.h
INSTALLHDR page_decrypt.h
INSTALLHDR cpu_number.h
INSTALLHDR pms.h
INSTALLHDR io_map_entries.h
INSTALLHDR processor.h
INSTALLHDR lock.h
INSTALLHDR locks.h
INSTALLHDR queue.h
INSTALLHDR machine_cpuid.h
INSTALLHDR sched_prim.h
INSTALLHDR machine_routines.h
INSTALLHDR sfi.h
CC kern_time.o
INSTALLHDR simple_lock.h
INSTALLHDR machine_kpc.h
INSTALLHDR startup.h
INSTALLHDR pal_routines.h
CC kperf_mp.o
INSTALLHDR task.h
INSTALLHDR pal_hibernate.h
INSTALLHDR telemetry.h
INSTALLHDR simple_lock.h
INSTALLHDR thread.h
INSTALLHDR cpu_capabilities.h
INSTALLHDR thread_call.h
INSTALLHDR cpu_capabilities.h
CC kpc_x86.o
INSTALLHDR timer_call.h
INSTALLHDR cpu_number.h
INSTALLHDR wait_queue.h
INSTALLHDR io_map_entries.h
INSTALLHDR zalloc.h
INSTALLHDR lock.h
INSTALLHDR ecc.h
INSTALLHDR locks.h
INSTALLHDR exc_resource.h
INSTALLHDR machine_cpuid.h
INSTALLHDR debug.h
INSTALLHDR machine_routines.h
INSTALLHDR ecc.h
INSTALLHDR machine_kpc.h
INSTALLHDR exc_resource.h
INSTALLHDR pal_routines.h
INSTALLHDR affinity.h
INSTALLHDR pal_hibernate.h
CC mac_data.o
INSTALLHDR assert.h
INSTALLHDR simple_lock.h
INSTALLHDR audit_sessionport.h
CC kern_xxx.o
INSTALLHDR call_entry.h
INSTALLHDR clock.h
INSTALLHDR coalition.h
INSTALLHDR cpu_number.h
INSTALLHDR cpu_data.h
CC startup64.o
INSTALLHDR debug.h
INSTALLHDR energy_perf.h
INSTALLHDR extmod_statistics.h
INSTALLHDR hv_support.h
INSTALLHDR ipc_mig.h
CC mac_label.o
INSTALLHDR ipc_misc.h
CC mach_process.o
INSTALLHDR kalloc.h
INSTALLHDR kext_alloc.h
INSTALLHDR kern_types.h
INSTALLHDR kpc.h
ERROR: ctfconvert: file does not contain dwarf type data (try compiling with -g)
CC panic_hooks.o
INSTALLHDR ledger.h
INSTALLHDR lock.h
INSTALLHDR KUNCUserNotifications.h
INSTALLHDR locks.h
INSTALLHDR UNDTypes.h
INSTALLHDR host.h
INSTALLHDR UNDTypes.defs
INSTALLHDR mach_param.h
CC mac_process.o
INSTALLHDR macro_help.h
INSTALLHDR UNDRequest.defs
INSTALLHDR page_decrypt.h
INSTALLHDR UNDReply.defs
INSTALLHDR pms.h
INSTALLHDR UNDTypes.h
INSTALLHDR processor.h
INSTALLHDR UNDTypes.defs
INSTALLHDR UNDRequest.defs
INSTALLHDR queue.h
CC vm_compressor_backing_store.o
INSTALLHDR UNDReply.defs
INSTALLHDR sched_prim.h
INSTALLHDR sfi.h
INSTALLHDR KUNCUserNotifications.h
INSTALLHDR simple_lock.h
INSTALLHDR UNDTypes.h
INSTALLHDR startup.h
INSTALLHDR UNDTypes.defs
INSTALLHDR task.h
INSTALLHDR UNDRequest.defs
INSTALLHDR telemetry.h
INSTALLHDR UNDReply.defs
CC mcache.o
INSTALLHDR thread.h
INSTALLHDR thread_call.h
INSTALLHDR timer_call.h
INSTALLHDR gssd_mach_types.h
INSTALLHDR wait_queue.h
INSTALLHDR gssd_mach.defs
INSTALLHDR zalloc.h
INSTALLHDR gssd_mach.h
CC default_pager.o
INSTALLHDR gssd_mach_types.h
INSTALLHDR gssd_mach.defs
INSTALLHDR gssd_mach_types.h
INSTALLHDR gssd_mach.defs
INSTALLHDR gssd_mach.h
INSTALLHDR kextd_mach.defs
INSTALLHDR kextd_mach.h
INSTALLHDR kextd_mach.defs
INSTALLHDR kextd_mach.defs
CC mac_vfs.o
INSTALLHDR kextd_mach.h
INSTALLHDR lockd_mach_types.h
INSTALLHDR lockd_mach.defs
INSTALLHDR lockd_mach.h
INSTALLHDR lockd_mach_types.h
CC dp_backing_store.o
INSTALLHDR lockd_mach.defs
INSTALLHDR lockd_mach_types.h
INSTALLHDR lockd_mach.defs
INSTALLHDR lockd_mach.h
CC spl.o
CC dp_memory_object.o
INSTALLHDR pmap.h
INSTALLHDR vm_fault.h
INSTALLHDR vm_kern.h
CC subr_log.o
INSTALLHDR vm_map.h
INSTALLHDR vm_options.h
INSTALLHDR vm_pageout.h
INSTALLHDR vm_protos.h
INSTALLHDR vm_shared_region.h
INSTALLHDR WKdm_new.h
INSTALLHDR pmap.h
INSTALLHDR vm_fault.h
INSTALLHDR vm_kern.h
INSTALLHDR vm_map.h
INSTALLHDR vm_options.h
CC subr_prf.o
INSTALLHDR vm_pageout.h
INSTALLHDR vm_protos.h
INSTALLHDR vm_shared_region.h
INSTALLHDR WKdm_new.h
INSTALLHDR string.h
INSTALLHDR string.h
INSTALLHDR kdp_callout.h
CC subr_prof.o
INSTALLHDR kdp_en_debugger.h
INSTALLHDR kdp_callout.h
INSTALLHDR kdp_en_debugger.h
INSTALLHDR pmc.h
CC mac_vfs_subr.o
INSTALLHDR pmc.h
INSTALLHDR context.h
INSTALLHDR timetrigger.h
INSTALLHDR pet.h
CC subr_sbuf.o
INSTALLHDR kperfbsd.h
INSTALLHDR action.h
INSTALLHDR kperf.h
INSTALLHDR random.h
CC default_pager_alerts_user.o
CC subr_xxx.o
CC mac_system.o
CC default_pager_object_server.o
CC sys_generic.o
CC mac_sysv_sem.o
CC gssd_mach.o
CC sys_pipe.o
CC lockd_mach.o
CC sys_socket.o
CC kextd_mach.o
CC UNDRequest.o
CC mac_sysv_shm.o
CC mac_sysv_msg.o
CC UNDReplyServer.o
CC KUNCUserNotifications.o
CC kdp.o
CC sys_domain.o
CC mac_posix_sem.o
CC mac_posix_shm.o
CC kern_stackshot.o
CC mac_socket.o
CC sys_coalition.o
CC mac_pipe.o
CC kdp_udp.o
Generating syscalls.c from /Users/Shared/BSA_10.10.1_rc1/bsd/kern/syscalls.master
CC kdp_serial.o
CC ipc_entry.o
CC mac_iokit.o
CC tty.o
CC tty_compat.o
CC mac_file.o
CC ipc_hash.o
CC tty_conf.o
CC mac_priv.o
CC tty_dev.o
CC ipc_importance.o
CC mac_pty.o
CC tty_ptmx.o
CC mac_kext.o
CC tty_pty.o
CC ipc_init.o
CC ipc_kmsg.o
CC tty_subr.o
LDFILELIST security
CC tty_tty.o
CC ubc_subr.o
CC ipc_mqueue.o
CC ipc_notify.o
CC uipc_domain.o
CC uipc_mbuf.o
CC uipc_mbuf2.o
CC ipc_object.o
CC ipc_port.o
CC uipc_proto.o
CC ipc_pset.o
CC ipc_right.o
CC uipc_socket.o
CC uipc_socket2.o
CC uipc_syscalls.o
CC ipc_space.o
CC ipc_table.o
CC ipc_voucher.o
CC mach_debug.o
CC uipc_usrreq.o
CC mach_kernelrpc.o
CC sysv_ipc.o
CC mach_msg.o
CC sysv_shm.o
CC mach_port.o
CC affinity.o
CC ast.o
CC sysv_sem.o
CC sysv_msg.o
CC audit_sessionport.o
CC btlog.o
CC mach_fat.o
CC clock.o
CC clock_oldops.o
CC coalition.o
CC counters.o
CC mach_loader.o
ERROR: ctfconvert: file does not contain dwarf type data (try compiling with -g)
CC posix_sem.o
CC posix_shm.o
CC qsort.o
CC debug.o
CC energy_perf.o
CC exception.o
CC kpi_socket.o
CC extmod_statistics.o
CC host.o
CC kpi_socketfilter.o
CC pthread_shims.o
CC proc_info.o
CC host_notify.o
CC process_policy.o
CC ipc_clock.o
CC ipc_host.o
CC kern_overrides.o
CC ipc_kobject.o
CC ipc_mig.o
CC ipc_misc.o
CC vm_pressure.o
CC socket_info.o
CC vnode_pager.o
CC ipc_sync.o
CC ipc_tt.o
CC kalloc.o
CC vm_unix.o
CC ledger.o
CC locks.o
CC dp_backing_file.o
CC vm_compressor_backing_file.o
CC machine.o
CC mk_sp.o
CC ux_exception.o
CC param.o
CC ioconf.o
CC mk_timer.o
CC chud_bsd_callback.o
CC page_decrypt.o
CC chud_process.o
CC printf.o
CC imageboot.o
CC priority.o
CC kperfbsd.o
CC processor.o
CC processor_data.o
CC kern_kpc.o
CC sched_average.o
CC proc_uuid_policy.o
CC conf.o
CC sched_dualq.o
CC cons.o
CC sched_prim.o
CC sched_multiq.o
CC km.o
CC kern_machdep.o
CC sfi.o
CC stack.o
CC stubs.o
CC systemcalls.o
CC sysctl.o
CC unix_signal.o
CC dtrace_isa.o
CC startup.o
CC dtrace_subr_x86.o
CC sync_lock.o
CC sync_sema.o
CC fbt_x86.o
CC syscall_emulation.o
CC sdt_x86.o
CC syscall_subr.o
CC fasttrap_isa.o
CC instr_size.o
CC syscall_sw.o
CC task.o
CC dis_tables.o
CC policy_check.o
CC task_policy.o
CC task_swap.o
CC bsd_stubs.o
CC cpu_in_cksum.o
CC thread.o
CC in_cksum.o
CC thread_act.o
CC thread_call.o
CC nfs4_subs.o
CC nfs4_vnops.o
CC krpc_subr.o
CC thread_policy.o
CC timer.o
CC nfs_bio.o
CC nfs_boot.o
CC timer_call.o
CC wait_queue.o
CC nfs_gss.o
CC zalloc.o
CC gzalloc.o
CC nfs_gss_crypto.o
CC bsd_kern.o
CC nfs_lock.o
CC hibernate.o
CC pmc.o
CC clock_server.o
CC clock_priv_server.o
CC nfs_node.o
CC nfs_serv.o
CC clock_reply_user.o
CC exc_user.o
CC exc_server.o
CC nfs_socket.o
CC host_priv_server.o
CC nfs_srvcache.o
CC host_security_server.o
CC nfs_subs.o
CC lock_set_server.o
CC mach_exc_user.o
CC mach_exc_server.o
CC mach_host_server.o
CC mach_notify_user.o
CC mach_port_server.o
CC mach_vm_server.o
CC nfs_syscalls.o
CC mach_voucher_server.o
CC nfs_vfsops.o
CC mach_voucher_attr_control_server.o
CC memory_object_server.o
CC memory_object_control_server.o
CC nfs_vnops.o
CC memory_object_default_server.o
CC nfs_upcall.o
CC upl_server.o
CC audit_triggers_user.o
CC netboot.o
CC task_access_user.o
CC telemetry_notification_user.o
CC bank.o
CC atm.o
CC dtrace.o
CC atm_notification_user.o
CC coalition_notification_user.o
CC processor_server.o
CC processor_set_server.o
CC task_server.o
CC thread_act_server.o
CC vm32_map_server.o
CC bsd_vm.o
CC vm_compressor.o
CC lockstat.o
CC dtrace_ptss.o
CC vm_compressor_pager.o
CC vm_phantom_cache.o
CC dtrace_subr.o
CC dtrace_glue.o
CC device_vm.o
CC memory_object.o
CC dtrace_alloc.o
ERROR: ctfconvert: file does not contain dwarf type data (try compiling with -g)
CC vm_debug.o
CC vm_fault.o
CC blist.o
CC fbt.o
CC vm_init.o
CC vm_kern.o
CC sdt.o
CC vm_map.o
CC sdt_subr.o
CC vm_map_store.o
CC vm_map_store_ll.o
CC systrace.o
CC profile_prvd.o
CC vm_map_store_rb.o
CC vm_object.o
CC fasttrap.o
CC randomdev.o
CC vm_pageout.o
CC vm_purgeable.o
CC memdev.o
CC vm_resident.o
CC mem.o
CC vm_shared_region.o
CC munge.o
CC unix_startup.o
CC crc32.o
CC random.o
CC vm_swapfile_pager.o
CC scanc.o
CC skpc.o
CC strsep.o
CC bcd.o
CC vm_user.o
CC memchr.o
CC vfs_attrlist.o
CC vm32_user.o
CC vfs_bio.o
CC vfs_cache.o
CC vfs_cluster.o
CC iokit_rpc.o
CC device_server.o
CC device_init.o
CC vfs_conf.o
CC kext_alloc.o
CC kmod.o
CC vfs_fslog.o
CC vfs_init.o
CC subrs.o
CC chud_cpu.o
CC vfs_lookup.o
CC vfs_quota.o
CC chud_glue.o
CC vfs_subr.o
CC chud_memory.o
CC chud_osfmk_callback.o
CC vfs_syscalls.o
CC vfs_support.o
CC chud_thread.o
CC kperf.o
CC action.o
CC vfs_utfconv.o
CC vfs_vnops.o
CC callstack.o
CC pet.o
CC vfs_xattr.o
CC threadinfo.o
CC vnode_if.o
CC timetrigger.o
CC kperf_kpc.o
CC kpi_vfs.o
CC kpc_thread.o
CC kpc_common.o
CC serial_general.o
CC vfs_journal.o
CC telemetry.o
CC ccdrbg_nisthmac.o
CC ccdigest_init.o
CC vfs_fsevents.o
CC ccdigest_update.o
CC cchmac.o
CC cchmac_init.o
CC cchmac_update.o
CC cchmac_final.o
CC dead_vnops.o
CC ccdigest_final_64be.o
CC ccsha1_eay.o
CC ccsha1_initial_state.o
CC devfs_fdesc_support.o
CC random.o
CC fifo_vnops.o
CC prng_yarrow.o
CC spec_vnops.o
CC fips_sha1.o
CC smf.o
CC comp.o
CC devfs_tree.o
CC devfs_vnops.o
CC prng.o
CC sha1mod.o
CC yarrowUtils.o
CC vm_apple_protect.o
CC pmap.o
CC devfs_vfsops.o
CC decmpfs.o
CC pmap_x86_common.o
CC net_stubs.o
ERROR: ctfconvert: file does not contain dwarf type data (try compiling with -g)
CC bpf.o
CC pmap_common.o
CC pmap_pcid.o
CC pal_routines.o
CC bpf_filter.o
CC if_bridge.o
CC if.o
AS pal_routines_asm.o
AS start.o
CC init.o
CC dlil.o
AS bcopy.o
AS bzero.o
AS WKdmDecompress_new.o
AS WKdmCompress_new.o
CC ether_if_module.o
AS WKdmData_new.o
AS i386_lock.o
AS locore.o
AS cswitch.o
CC ether_inet_pr_module.o
AS machine_routines_asm.o
AS commpage_asm.o
AS fifo_queues.o
AS idt64.o
LDFILELIST osfmk
CC ether_inet6_pr_module.o
CC if_loop.o
CC if_mib.o
CC if_vlan.o
CC multicast_list.o
CC if_bond.o
CC devtimer.o
CC ndrv.o
CC radix.o
CC raw_cb.o
CC raw_usrreq.o
CC route.o
CC rtsock.o
CC netsrc.o
CC ntstat.o
CC if_gif.o
CC if_stf.o
CC kpi_interface.o
CC kpi_protocol.o
CC kpi_interfacefilter.o
CC net_str_id.o
CC if_utun.o
CC if_utun_crypto.o
CC if_utun_crypto_dtls.o
CC if_utun_crypto_ipsec.o
CC if_ipsec.o
CC necp.o
CC if_pflog.o
CC pf.o
CC pf_if.o
CC pf_ioctl.o
CC pf_norm.o
CC pf_osfp.o
CC pf_ruleset.o
CC pf_table.o
CC iptap.o
CC pktap.o
CC if_llreach.o
CC flowhash.o
CC flowadv.o
CC content_filter.o
CC packet_mangler.o
CC classq.o
CC classq_sfb.o
CC classq_subr.o
CC classq_util.o
CC pktsched.o
ERROR: ctfconvert: file does not contain dwarf type data (try compiling with -g)
CC pktsched_qfq.o
CC pktsched_tcq.o
CC igmp.o
CC in.o
CC in_dhcp.o
CC dhcp_options.o
CC in_arp.o
CC in_mcast.o
CC in_pcb.o
CC in_pcblist.o
CC in_proto.o
CC in_rmx.o
CC in_tclass.o
CC ip_divert.o
CC ip_dummynet.o
CC ip_fw2.o
CC ip_fw2_compat.o
CC ip_icmp.o
CC ip_id.o
CC ip_input.o
CC ip_output.o
CC raw_ip.o
CC tcp_input.o
CC tcp_output.o
CC tcp_sack.o
CC tcp_subr.o
CC tcp_timer.o
CC tcp_usrreq.o
CC tcp_cc.o
CC tcp_newreno.o
CC tcp_cubic.o
CC cbrtf.o
CC tcp_lro.o
CC tcp_ledbat.o
CC udp_usrreq.o
CC in_gif.o
CC ip_ecn.o
CC ip_encap.o
CC kpi_ipfilter.o
CC flow_divert.o
CC mp_proto.o
CC mp_pcb.o
CC mptcp.o
CC mptcp_subr.o
CC mptcp_usrreq.o
CC mptcp_opt.o
CC mptcp_timer.o
CC ah_core.o
ERROR: mptcp_usrreq.c: die 25750: no attr 0x49
CC ah_input.o
CC ah_output.o
CC esp_core.o
CC esp_input.o
CC esp_output.o
CC esp_rijndael.o
CC ipsec.o
CC dest6.o
CC frag6.o
CC icmp6.o
CC in6.o
CC in6_cga.o
CC in6_cksum.o
CC in6_gif.o
CC ip6_fw.o
CC ip6_forward.o
CC in6_ifattach.o
CC ip6_input.o
CC ip6_output.o
CC in6_src.o
CC ipcomp_core.o
CC ipcomp_input.o
CC ipcomp_output.o
CC in6_mcast.o
CC in6_pcb.o
CC in6_proto.o
CC in6_rmx.o
CC mld6.o
CC nd6.o
CC nd6_nbr.o
CC nd6_prproxy.o
CC nd6_rtr.o
CC nd6_send.o
CC raw_ip6.o
CC route6.o
CC scope6.o
CC udp6_output.o
CC udp6_usrreq.o
CC ip6_id.o
CC key.o
CC key_debug.o
CC keysock.o
ERROR: ctfconvert: file does not contain dwarf type data (try compiling with -g)
CC keydb.o
CC rc4.o
CC hfs_attrlist.o
CC hfs_btreeio.o
CC hfs_catalog.o
CC hfs_chash.o
CC hfs_cnode.o
CC hfs_encodinghint.o
CC hfs_encodings.o
CC hfs_endian.o
CC hfs_hotfiles.o
CC hfs_link.o
CC hfs_lookup.o
CC hfs_notification.o
CC hfs_quota.o
CC hfs_readwrite.o
CC hfs_resize.o
CC hfs_search.o
CC hfs_vfsops.o
CC hfs_vfsutils.o
CC hfs_vnops.o
CC hfs_xattr.o
CC MacOSStubs.o
CC hfs_cprotect.o
CC rangelist.o
CC BTree.o
CC BTreeAllocate.o
CC BTreeMiscOps.o
CC BTreeNodeOps.o
CC BTreeNodeReserve.o
CC BTreeScanner.o
CC BTreeTreeOps.o
CC CatalogUtilities.o
CC FileIDsServices.o
CC BTreeWrapper.o
CC FileExtentMapping.o
CC VolumeAllocation.o
CC UnicodeWrappers.o
CC audit.o
CC audit_arg.o
CC audit_bsd.o
CC audit_bsm.o
CC audit_bsm_errno.o
CC audit_bsm_fcntl.o
CC audit_bsm_domain.o
CC audit_bsm_klib.o
CC audit_bsm_socket_type.o
CC audit_bsm_token.o
CC audit_kevents.o
CC init_sysent.o
CC syscalls.o
LDFILELIST bsd
CC lastkernelconstructor.o
CC version.o
LD kernel.unstripped
undef: _opemu_utrap
undef: _opemu_ktrap
undef: _BF_set_key
undef: _BF_encrypt
undef: _BF_decrypt
Undefined symbols for architecture x86_64:
"_opemu_utrap", referenced from:
_user_trap in trap.o
"_opemu_ktrap", referenced from:
_kernel_trap in trap.o
"_BF_set_key", referenced from:
_ink_decrypt in page_decrypt.o
"_BF_encrypt", referenced from:
_BF_cbc_encrypt in page_decrypt.o
"_BF_decrypt", referenced from:
_BF_cbc_encrypt in page_decrypt.o
ld: symbol(s) not found for architecture x86_64
clang: error: linker command failed with exit code 1 (use -v to see invocation)
make[3]: [/users/Shared/BSA_10.10.1_rc1/BUILD/obj/RELEASE_X86_64//kernel.unstripped] Error 1 (ignored)
STRIP kernel
DSYMUTIL kernel.dSYM
error: /Applications/Xcode.app/Contents/Developer/Toolchains/XcodeDefault.xctoolchain/usr/bin/strip: can't open file: /Users/Shared/BSA_10.10.1_rc1/BUILD/obj/RELEASE_X86_64//kernel.unstripped (No such file or directory)
make[3]: [/users/Shared/BSA_10.10.1_rc1/BUILD/obj/RELEASE_X86_64//kernel] Error 1 (ignored)
CTFMERGE kernel
error: unable to open executable '/Users/Shared/BSA_10.10.1_rc1/BUILD/obj/RELEASE_X86_64//kernel.unstripped'
make[3]: [/users/Shared/BSA_10.10.1_rc1/BUILD/obj/RELEASE_X86_64//kernel.dSYM] Error 1 (ignored)
mv: rename /Users/Shared/BSA_10.10.1_rc1/BUILD/obj/RELEASE_X86_64//kernel.dSYM/Contents/Resources/DWARF/kernel.unstripped to /Users/Shared/BSA_10.10.1_rc1/BUILD/obj/RELEASE_X86_64//kernel.dSYM/Contents/Resources/DWARF/kernel: No such file or directory
make[3]: [/users/Shared/BSA_10.10.1_rc1/BUILD/obj/RELEASE_X86_64//kernel.dSYM] Error 1 (ignored)
ERROR: ctfmerge: Cannot open output file /Users/Shared/BSA_10.10.1_rc1/BUILD/obj/RELEASE_X86_64//kernel for r/w: No such file or directory
make[4]: *** No rule to make target `/Users/Shared/BSA_10.10.1_rc1/BUILD/obj/RELEASE_X86_64/kernel', needed by `/Users/Shared/BSA_10.10.1_rc1/BUILD/obj/RELEASE_X86_64/allsymbols'.
SUPPORTED_KPI (x86_64)
SUPPORTED_KPI (all)
mkdir: /Users/Shared/BSA_10.10.1_rc1/BUILD/obj/RELEASE_X86_64/kernel.dSYM/Contents/Resources/Python/lldbmacros/core/: Not a directory
make[5]: [/users/Shared/BSA_10.10.1_rc1/BUILD/obj/RELEASE_X86_64/kernel.dSYM/Contents/Resources/Python/lldbmacros/core/standard.py] Error 1 (ignored)
mkdir: /Users/Shared/BSA_10.10.1_rc1/BUILD/obj/RELEASE_X86_64/kernel.dSYM/Contents/Resources/Python/lldbmacros/core/: Not a directory
make[5]: [/users/Shared/BSA_10.10.1_rc1/BUILD/obj/RELEASE_X86_64/kernel.dSYM/Contents/Resources/Python/lldbmacros/core/cvalue.py] Error 1 (ignored)
mkdir: /Users/Shared/BSA_10.10.1_rc1/BUILD/obj/RELEASE_X86_64/kernel.dSYM/Contents/Resources/Python/lldbmacros/core/: Not a directory
make[5]: [/users/Shared/BSA_10.10.1_rc1/BUILD/obj/RELEASE_X86_64/kernel.dSYM/Contents/Resources/Python/lldbmacros/core/__init__.py] Error 1 (ignored)
mkdir: /Users/Shared/BSA_10.10.1_rc1/BUILD/obj/RELEASE_X86_64/kernel.dSYM/Contents/Resources/Python/lldbmacros/core/: Not a directory
make[5]: [/users/Shared/BSA_10.10.1_rc1/BUILD/obj/RELEASE_X86_64/kernel.dSYM/Contents/Resources/Python/lldbmacros/core/configuration.py] Error 1 (ignored)
make[4]: Target `do_config_all' not remade because of errors.
make[3]: [config_all] Error 2 (ignored)
mkdir: /Users/Shared/BSA_10.10.1_rc1/BUILD/obj/RELEASE_X86_64/kernel.dSYM/Contents/Resources/Python/lldbmacros/core/: Not a directory
make[5]: [/users/Shared/BSA_10.10.1_rc1/BUILD/obj/RELEASE_X86_64/kernel.dSYM/Contents/Resources/Python/lldbmacros/core/caching.py] Error 1 (ignored)
installfile: installfile: mkstemp(/Users/Shared/BSA_10.10.1_rc1/BUILD/obj/RELEASE_X86_64/kernel.dSYM/Contents/Resources/Python/lldbmacros/core/__init__.py.hDtNIP): mkstemp(/Users/Shared/BSA_10.10.1_rc1/BUILD/obj/RELEASE_X86_64/kernel.dSYM/Contents/Resources/Python/lldbmacros/core/caching.py.3ZR6hx)Not a directory
: Not a directory
installfile: mkstemp(/Users/Shared/BSA_10.10.1_rc1/BUILD/obj/RELEASE_X86_64/kernel.dSYM/Contents/Resources/Python/lldbmacros/core/configuration.py.htmwEH): Not a directory
make[5]: [/users/Shared/BSA_10.10.1_rc1/BUILD/obj/RELEASE_X86_64/kernel.dSYM/Contents/Resources/Python/lldbmacros/core/__init__.py] Error 69 (ignored)
make[5]: [/users/Shared/BSA_10.10.1_rc1/BUILD/obj/RELEASE_X86_64/kernel.dSYM/Contents/Resources/Python/lldbmacros/core/caching.py] Error 69 (ignored)
installfile: mkstemp(/Users/Shared/BSA_10.10.1_rc1/BUILD/obj/RELEASE_X86_64/kernel.dSYM/Contents/Resources/Python/lldbmacros/core/cvalue.py.hnu6Pk): Not a directory
installfile: mkstemp(/Users/Shared/BSA_10.10.1_rc1/BUILD/obj/RELEASE_X86_64/kernel.dSYM/Contents/Resources/Python/lldbmacros/core/standard.py.4VimL5): Not a directory
make[5]: [/users/Shared/BSA_10.10.1_rc1/BUILD/obj/RELEASE_X86_64/kernel.dSYM/Contents/Resources/Python/lldbmacros/core/cvalue.py] Error 69 (ignored)
make[5]: [/users/Shared/BSA_10.10.1_rc1/BUILD/obj/RELEASE_X86_64/kernel.dSYM/Contents/Resources/Python/lldbmacros/core/standard.py] Error 69 (ignored)
touch: /Users/Shared/BSA_10.10.1_rc1/BUILD/obj/RELEASE_X86_64/kernel.dSYM/Contents/Resources/Python/lldbmacros/: Not a directory
touch: /Users/Shared/BSA_10.10.1_rc1/BUILD/obj/RELEASE_X86_64/kernel.dSYM/Contents/Resources/Python/lldbmacros/: Not a directory
make[5]: [/users/Shared/BSA_10.10.1_rc1/BUILD/obj/RELEASE_X86_64/kernel.dSYM/Contents/Resources/Python/lldbmacros/core/caching.py] Error 1 (ignored)
make[5]: [/users/Shared/BSA_10.10.1_rc1/BUILD/obj/RELEASE_X86_64/kernel.dSYM/Contents/Resources/Python/lldbmacros/core/__init__.py] Error 1 (ignored)
make[5]: [/users/Shared/BSA_10.10.1_rc1/BUILD/obj/RELEASE_X86_64/kernel.dSYM/Contents/Resources/Python/lldbmacros/core/configuration.py] Error 69 (ignored)
touch: /Users/Shared/BSA_10.10.1_rc1/BUILD/obj/RELEASE_X86_64/kernel.dSYM/Contents/Resources/Python/lldbmacros/: Not a directory
make[5]: [/users/Shared/BSA_10.10.1_rc1/BUILD/obj/RELEASE_X86_64/kernel.dSYM/Contents/Resources/Python/lldbmacros/core/cvalue.py] Error 1 (ignored)
touch: /Users/Shared/BSA_10.10.1_rc1/BUILD/obj/RELEASE_X86_64/kernel.dSYM/Contents/Resources/Python/lldbmacros/: Not a directory
make[5]: [/users/Shared/BSA_10.10.1_rc1/BUILD/obj/RELEASE_X86_64/kernel.dSYM/Contents/Resources/Python/lldbmacros/core/standard.py] Error 1 (ignored)
touch: /Users/Shared/BSA_10.10.1_rc1/BUILD/obj/RELEASE_X86_64/kernel.dSYM/Contents/Resources/Python/lldbmacros/: Not a directory
make[5]: [/users/Shared/BSA_10.10.1_rc1/BUILD/obj/RELEASE_X86_64/kernel.dSYM/Contents/Resources/Python/lldbmacros/core/configuration.py] Error 1 (ignored)
mkdir: /Users/Shared/BSA_10.10.1_rc1/BUILD/obj/RELEASE_X86_64/kernel.dSYM/Contents/Resources/Python/lldbmacros/core/: Not a directory
make[5]: [/users/Shared/BSA_10.10.1_rc1/BUILD/obj/RELEASE_X86_64/kernel.dSYM/Contents/Resources/Python/lldbmacros/core/lazytarget.py] Error 1 (ignored)
mkdir: /Users/Shared/BSA_10.10.1_rc1/BUILD/obj/RELEASE_X86_64/kernel.dSYM/Contents/Resources/Python/lldbmacros/core/: Not a directory
make[5]: [/users/Shared/BSA_10.10.1_rc1/BUILD/obj/RELEASE_X86_64/kernel.dSYM/Contents/Resources/Python/lldbmacros/core/kernelcore.py] Error 1 (ignored)
mkdir: /Users/Shared/BSA_10.10.1_rc1/BUILD/obj/RELEASE_X86_64/kernel.dSYM/Contents/Resources/Python/lldbmacros/core/: Not a directory
make[5]: [/users/Shared/BSA_10.10.1_rc1/BUILD/obj/RELEASE_X86_64/kernel.dSYM/Contents/Resources/Python/lldbmacros/core/operating_system.py] Error 1 (ignored)
mkdir: /Users/Shared/BSA_10.10.1_rc1/BUILD/obj/RELEASE_X86_64/kernel.dSYM/Contents/Resources/Python/lldbmacros/core/: Not a directory
make[5]: [/users/Shared/BSA_10.10.1_rc1/BUILD/obj/RELEASE_X86_64/kernel.dSYM/Contents/Resources/Python/lldbmacros/core/xnu_lldb_init.py] Error 1 (ignored)
mkdir: /Users/Shared/BSA_10.10.1_rc1/BUILD/obj/RELEASE_X86_64/kernel.dSYM/Contents/Resources/Python/lldbmacros/plugins/: Not a directory
make[5]: [/users/Shared/BSA_10.10.1_rc1/BUILD/obj/RELEASE_X86_64/kernel.dSYM/Contents/Resources/Python/lldbmacros/plugins/__init__.py] Error 1 (ignored)
installfile: mkstemp(/Users/Shared/BSA_10.10.1_rc1/BUILD/obj/RELEASE_X86_64/kernel.dSYM/Contents/Resources/Python/lldbmacros/core/kernelcore.py.hyMbkF): Not a directory
make[5]: [/users/Shared/BSA_10.10.1_rc1/BUILD/obj/RELEASE_X86_64/kernel.dSYM/Contents/Resources/Python/lldbmacros/core/kernelcore.py] Error 69 (ignored)
touch: /Users/Shared/BSA_10.10.1_rc1/BUILD/obj/RELEASE_X86_64/kernel.dSYM/Contents/Resources/Python/lldbmacros/: Not a directory
make[5]: [/users/Shared/BSA_10.10.1_rc1/BUILD/obj/RELEASE_X86_64/kernel.dSYM/Contents/Resources/Python/lldbmacros/core/kernelcore.py] Error 1 (ignored)
mkdir: /Users/Shared/BSA_10.10.1_rc1/BUILD/obj/RELEASE_X86_64/kernel.dSYM/Contents/Resources/Python/lldbmacros/plugins/: Not a directory
make[5]: [/users/Shared/BSA_10.10.1_rc1/BUILD/obj/RELEASE_X86_64/kernel.dSYM/Contents/Resources/Python/lldbmacros/plugins/zprint_perf_log.py] Error 1 (ignored)
installfile: mkstemp(/Users/Shared/BSA_10.10.1_rc1/BUILD/obj/RELEASE_X86_64/kernel.dSYM/Contents/Resources/Python/lldbmacros/core/xnu_lldb_init.py.8vYxC0): Not a directory
make[5]: [/users/Shared/BSA_10.10.1_rc1/BUILD/obj/RELEASE_X86_64/kernel.dSYM/Contents/Resources/Python/lldbmacros/core/xnu_lldb_init.py] Error 69 (ignored)
installfile: mkstemp(/Users/Shared/BSA_10.10.1_rc1/BUILD/obj/RELEASE_X86_64/kernel.dSYM/Contents/Resources/Python/lldbmacros/core/lazytarget.py.vU8t7I): Not a directory
make[5]: [/users/Shared/BSA_10.10.1_rc1/BUILD/obj/RELEASE_X86_64/kernel.dSYM/Contents/Resources/Python/lldbmacros/core/lazytarget.py] Error 69 (ignored)touch:
/Users/Shared/BSA_10.10.1_rc1/BUILD/obj/RELEASE_X86_64/kernel.dSYM/Contents/Resources/Python/lldbmacros/: Not a directory
make[5]: [/users/Shared/BSA_10.10.1_rc1/BUILD/obj/RELEASE_X86_64/kernel.dSYM/Contents/Resources/Python/lldbmacros/core/xnu_lldb_init.py] Error 1 (ignored)
touch: /Users/Shared/BSA_10.10.1_rc1/BUILD/obj/RELEASE_X86_64/kernel.dSYM/Contents/Resources/Python/lldbmacros/: Not a directory
installfile: make[5]: mkstemp(/Users/Shared/BSA_10.10.1_rc1/BUILD/obj/RELEASE_X86_64/kernel.dSYM/Contents/Resources/Python/lldbmacros/plugins/__init__.py.7d9zIp)[/users/Shared/BSA_10.10.1_rc1/BUILD/obj/RELEASE_X86_64/kernel.dSYM/Contents/Resources/Python/lldbmacros/core/lazytarget.py] Error 1 (ignored):
Not a directory
mkdir: /Users/Shared/BSA_10.10.1_rc1/BUILD/obj/RELEASE_X86_64/kernel.dSYM/Contents/Resources/Python/lldbmacros/: Not a directory
make[5]: [/users/Shared/BSA_10.10.1_rc1/BUILD/obj/RELEASE_X86_64/kernel.dSYM/Contents/Resources/Python/lldbmacros/atm.py] Error 1 (ignored)
make[5]: [/users/Shamkdir: red/BSA_10.10.1_rc1/BUILD/obj/RELEASE_X86_64/kernel.dSYM/Contents/Resources/Python/lldbmacros/plugins/__init__.py] Error 69 (ignored)
/Users/Shared/BSA_10.10.1_rc1/BUILD/obj/RELEASE_X86_64/kernel.dSYM/Contents/Resources/Python/lldbmacros/: Not a directory
make[5]: [/users/Shared/BSA_10.10.1_rc1/BUILD/obj/RELEASE_X86_64/kernel.dSYM/Contents/Resources/Python/lldbmacros/bank.py] Error 1 (ignored)
touch: /Users/Shared/BSA_10.10.1_rc1/BUILD/obj/RELEASE_X86_64/kernel.dSYM/Contents/Resources/Python/lldbmacros/: Not a directory
installfile: mkstemp(/Users/Shared/BSA_10.10.1_rc1/BUILD/obj/RELEASE_X86_64/kernel.dSYM/Contents/Resources/Python/lldbmacros/atm.py.eZeklS): Not a directory
make[5]: [/users/Shared/BSA_10.10.1_rc1/BUILD/obj/RELEASE_X86_64/kernel.dSYM/Contents/Resources/Python/lldbmacros/atm.py] Error 69 (ignored)
make[5]: [/users/Shared/BSA_10.10.1_rc1/BUILD/obj/RELEASE_X86_64/kernel.dSYM/Contents/Resources/Python/lldbmacros/plugins/__init__.py] Error 1 (ignored)
installfile: mkstemp(/Users/Shared/BSA_10.10.1_rc1/BUILD/obj/RELEASE_X86_64/kernel.dSYM/Contents/Resources/Python/lldbmacros/plugins/zprint_perf_log.py.pNiiMd): Not a directory
make[5]: [/users/Shared/BSA_10.10.1_rc1/BUILD/obj/RELEASE_X86_64/kernel.dSYM/Contents/Resources/Python/lldbmacros/plugins/zprint_perf_log.py] Error 69 (ignored)
installfile: mkstemp(/Users/Shared/BSA_10.10.1_rc1/BUILD/obj/RELEASE_X86_64/kernel.dSYM/Contents/Resources/Python/lldbmacros/core/operating_system.py.Ss4P3E): Not a directory
touch: make[5]: /Users/Shared/BSA_10.10.1_rc1/BUILD/obj/RELEASE_X86_64/kernel.dSYM/Contents/Resources/Python/lldbmacros/[/users/Shared/BSA_10.10.1_rc1/BUILD/obj/RELEASE_X86_64/kernel.dSYM/Contents/Resources/Python/lldbmacros/core/operating_system.py] Error 69 (ignored):
Not a directory
mkdir: /Users/Shared/BSA_10.10.1_rc1/BUILD/obj/RELEASE_X86_64/kernel.dSYM/Contents/Resources/Python/lldbmacros/: Not a directory
make[5]: [/users/Shared/BSA_10.10.1_rc1/BUILD/obj/RELEASE_X86_64/kernel.dSYM/Contents/Resources/Python/lldbmacros/atm.py] Error 1 (ignored)
make[5]: [/users/Shared/BSA_10.10.1_rc1/BUILD/obj/RELEASE_X86_64/kernel.dSYM/Contents/Resources/Python/lldbmacros/xnu.py] Error 1 (ignored)
touch: /Users/Shared/BSA_10.10.1_rc1/BUILD/obj/RELEASE_X86_64/kernel.dSYM/Contents/Resources/Python/lldbmacros/: Not a directory
touch: /Users/Shared/BSA_10.10.1_rc1/BUILD/obj/RELEASE_X86_64/kernel.dSYM/Contents/Resources/Python/lldbmacros/: Not a directory
make[5]: [/users/Shared/BSA_10.10.1_rc1/BUILD/obj/RELEASE_X86_64/kernel.dSYM/Contents/Resources/Python/lldbmacros/plugins/zprint_perf_log.py] Error 1 (ignored)
make[5]: [/users/Shared/BSA_10.10.1_rc1/BUILD/obj/RELEASE_X86_64/kernel.dSYM/Contents/Resources/Python/lldbmacros/core/operating_system.py] Error 1 (ignored)
mkdir: /Users/Shared/BSA_10.10.1_rc1/BUILD/obj/RELEASE_X86_64/kernel.dSYM/Contents/Resources/Python/lldbmacros/: Not a directory
make[5]: [/users/Shared/BSA_10.10.1_rc1/BUILD/obj/RELEASE_X86_64/kernel.dSYM/Contents/Resources/Python/lldbmacros/xnudefines.py] Error 1 (ignored)
mkdir: /Users/Shared/BSA_10.10.1_rc1/BUILD/obj/RELEASE_X86_64/kernel.dSYM/Contents/Resources/Python/lldbmacros/: Not a directory
make[5]: [/users/Shared/BSA_10.10.1_rc1/BUILD/obj/RELEASE_X86_64/kernel.dSYM/Contents/Resources/Python/lldbmacros/mbufdefines.py] Error 1 (ignored)
mkdir: /Users/Shared/BSA_10.10.1_rc1/BUILD/obj/RELEASE_X86_64/kernel.dSYM/Contents/Resources/Python/lldbmacros/: Not a directory
make[5]: [/users/Shared/BSA_10.10.1_rc1/BUILD/obj/RELEASE_X86_64/kernel.dSYM/Contents/Resources/Python/lldbmacros/netdefines.py] Error 1 (ignored)
installfile: mkstemp(/Users/Shared/BSA_10.10.1_rc1/BUILD/obj/RELEASE_X86_64/kernel.dSYM/Contents/Resources/Python/lldbmacros/bank.py.J5Zt4D): Not a directory
make[5]: [/users/Shared/BSA_10.10.1_rc1/BUILD/obj/RELEASE_X86_64/kernel.dSYM/Contents/Resources/Python/lldbmacros/bank.py] Error 69 (ignored)
touch: /Users/Shared/BSA_10.10.1_rc1/BUILD/obj/RELEASE_X86_64/kernel.dSYM/Contents/Resources/Python/lldbmacros/: Not a directory
make[5]: [/users/Shared/BSA_10.10.1_rc1/BUILD/obj/RELEASE_X86_64/kernel.dSYM/Contents/Resources/Python/lldbmacros/bank.py] Error 1 (ignored)
mkdir: /Users/Shared/BSA_10.10.1_rc1/BUILD/obj/RELEASE_X86_64/kernel.dSYM/Contents/Resources/Python/lldbmacros/: Not a directory
make[5]: [/users/Shared/BSA_10.10.1_rc1/BUILD/obj/RELEASE_X86_64/kernel.dSYM/Contents/Resources/Python/lldbmacros/routedefines.py] Error 1 (ignored)
installfile: mkstemp(/Users/Shared/BSA_10.10.1_rc1/BUILD/obj/RELEASE_X86_64/kernel.dSYM/Contents/Resources/Python/lldbmacros/mbufdefines.py.KPphoS): Not a directory
installfile: mkstemp(/Users/Shared/BSA_10.10.1_rc1/BUILD/obj/RELEASE_X86_64/kernel.dSYM/Contents/Resources/Python/lldbmacros/xnudefines.py.zA9vVx): make[5]: Not a directory
[/users/Shared/BSA_10.10.1_rc1/BUILD/obj/RELEASE_X86_64/kernel.dSYM/Contents/Resources/Python/lldbmacros/mbufdefines.py] Error 69 (ignored)
make[5]: [/users/Shared/BSA_10.10.1_rc1/BUILD/obj/RELEASE_X86_64/kernel.dSYM/Contents/Resources/Python/lldbmacros/xnudefines.py] Error 69 (ignored)
touch: /Users/Shared/BSA_10.10.1_rc1/BUILD/obj/RELEASE_X86_64/kernel.dSYM/Contents/Resources/Python/lldbmacros/: Not a directory
make[5]: [/users/Shared/BSA_10.10.1_rc1/BUILD/obj/RELEASE_X86_64/kernel.dSYM/Contents/Resources/Python/lldbmacros/mbufdefines.py] Error 1 (ignored)
touch: /Users/Shared/BSA_10.10.1_rc1/BUILD/obj/RELEASE_X86_64/kernel.dSYM/Contents/Resources/Python/lldbmacros/: Not a directory
make[5]: [/users/Shared/BSA_10.10.1_rc1/BUILD/obj/RELEASE_X86_64/kernel.dSYM/Contents/Resources/Python/lldbmacros/xnudefines.py] Error 1 (ignored)
mkdir: /Users/Shared/BSA_10.10.1_rc1/BUILD/obj/RELEASE_X86_64/kernel.dSYM/Contents/Resources/Python/lldbmacros/: Not a directory
make[5]: [/users/Shared/BSA_10.10.1_rc1/BUILD/obj/RELEASE_X86_64/kernel.dSYM/Contents/Resources/Python/lldbmacros/ipc.py] Error 1 (ignored)
mkdir: /Users/Shared/BSA_10.10.1_rc1/BUILD/obj/RELEASE_X86_64/kernel.dSYM/Contents/Resources/Python/lldbmacros/: Not a directory
make[5]: [/users/Shared/BSA_10.10.1_rc1/BUILD/obj/RELEASE_X86_64/kernel.dSYM/Contents/Resources/Python/lldbmacros/ipcimportancedetail.py] Error 1 (ignored)
installfile: mkstemp(/Users/Shared/BSA_10.10.1_rc1/BUILD/obj/RELEASE_X86_64/kernel.dSYM/Contents/Resources/Python/lldbmacros/routedefines.py.BJP02I): Not a directory
installfile: mkstemp(/Users/Shared/BSA_10.10.1_rc1/BUILD/obj/RELEASE_X86_64/kernel.dSYM/Contents/Resources/Python/lldbmacros/xnu.py.flgz0z): Not a directory
make[5]: [/users/Shared/BSA_10.10.1_rc1/BUILD/obj/RELEASE_X86_64/kernel.dSYM/Contents/Resources/Python/lldbmacros/routedefines.py] Error 69 (ignored)
make[5]: [/users/Shared/BSA_10.10.1_rc1/BUILD/obj/RELEASE_X86_64/kernel.dSYM/Contents/Resources/Python/lldbmacros/xnu.py] Error 69 (ignored)
touch: /Users/Shared/BSA_10.10.1_rc1/BUILD/obj/RELEASE_X86_64/kernel.dSYM/Contents/Resources/Python/lldbmacros/: Not a directory
touch: make[5]: /Users/Shared/BSA_10.10.1_rc1/BUILD/obj/RELEASE_X86_64/kernel.dSYM/Contents/Resources/Python/lldbmacros/[/users/Shared/BSA_10.10.1_rc1/BUILD/obj/RELEASE_X86_64/kernel.dSYM/Contents/Resources/Python/lldbmacros/routedefines.py] Error 1 (ignored):
Not a directory
make[5]: [/users/Shared/BSA_10.10.1_rc1/BUILD/obj/RELEASE_X86_64/kernel.dSYM/Contents/Resources/Python/lldbmacros/xnu.py] Error 1 (ignored)
mkdir: /Users/Shared/BSA_10.10.1_rc1/BUILD/obj/RELEASE_X86_64/kernel.dSYM/Contents/Resources/Python/lldbmacros/: Not a directory
make[5]: [/users/Shared/BSA_10.10.1_rc1/BUILD/obj/RELEASE_X86_64/kernel.dSYM/Contents/Resources/Python/lldbmacros/scheduler.py] Error 1 (ignored)
mkdir: /Users/Shared/BSA_10.10.1_rc1/BUILD/obj/RELEASE_X86_64/kernel.dSYM/Contents/Resources/Python/lldbmacros/: Not a directory
make[5]: [/users/Shared/BSA_10.10.1_rc1/BUILD/obj/RELEASE_X86_64/kernel.dSYM/Contents/Resources/Python/lldbmacros/structanalyze.py] Error 1 (ignored)
installfile: mkstemp(/Users/Shared/BSA_10.10.1_rc1/BUILD/obj/RELEASE_X86_64/kernel.dSYM/Contents/Resources/Python/lldbmacros/netdefines.py.JrYhCr): Not a directory
make[5]: [/users/Shared/BSA_10.10.1_rc1/BUILD/obj/RELEASE_X86_64/kernel.dSYM/Contents/Resources/Python/lldbmacros/netdefines.py] Error 69 (ignored)
touch: /Users/Shared/BSA_10.10.1_rc1/BUILD/obj/RELEASE_X86_64/kernel.dSYM/Contents/Resources/Python/lldbmacros/: Not a directory
make[5]: [/users/Shared/BSA_10.10.1_rc1/BUILD/obj/RELEASE_X86_64/kernel.dSYM/Contents/Resources/Python/lldbmacros/netdefines.py] Error 1 (ignored)
mkdir: /Users/Shared/BSA_10.10.1_rc1/BUILD/obj/RELEASE_X86_64/kernel.dSYM/Contents/Resources/Python/lldbmacros/: Not a directory
make[5]: [/users/Shared/BSA_10.10.1_rc1/BUILD/obj/RELEASE_X86_64/kernel.dSYM/Contents/Resources/Python/lldbmacros/pmap.py] Error 1 (ignored)
installfile: mkstemp(/Users/Shared/BSA_10.10.1_rc1/BUILD/obj/RELEASE_X86_64/kernel.dSYM/Contents/Resources/Python/lldbmacros/ipcimportancedetail.py.UMz6Lh): Not a directory
make[5]: [/users/Shared/BSA_10.10.1_rc1/BUILD/obj/RELEASE_X86_64/kernel.dSYM/Contents/Resources/Python/lldbmacros/ipcimportancedetail.py] Error 69 (ignored)
touch: /Users/Shared/BSA_10.10.1_rc1/BUILD/obj/RELEASE_X86_64/kernel.dSYM/Contents/Resources/Python/lldbmacros/: Not a directory
installfile: mkstemp(/Users/Shared/BSA_10.10.1_rc1/BUILD/obj/RELEASE_X86_64/kernel.dSYM/Contents/Resources/Python/lldbmacros/structanalyze.py.yjZGjR): Not a directory
installfile: mkstemp(/Users/Shared/BSA_10.10.1_rc1/BUILD/obj/RELEASE_X86_64/kernel.dSYM/Contents/Resources/Python/lldbmacros/scheduler.py.2YARxB): Not a directory
make[5]: [/users/Shared/BSA_10.10.1_rc1/BUILD/obj/RELEASE_X86_64/kernel.dSYM/Contents/Resources/Python/lldbmacros/structanalyze.py] Error 69 (ignored)
make[5]: [/users/Shared/BSA_10.10.1_rc1/BUILD/obj/RELEASE_X86_64/kernel.dSYM/Contents/Resources/Python/lldbmacros/scheduler.py] Error 69 (ignored)
make[5]: [/users/Shared/BSA_10.10.1_rc1/BUILD/obj/RELEASE_X86_64/kernel.dSYM/Contents/Resources/Python/lldbmacros/ipcimportancedetail.py] Error 1 (ignored)
installfile: mkstemp(/Users/Shared/BSA_10.10.1_rc1/BUILD/obj/RELEASE_X86_64/kernel.dSYM/Contents/Resources/Python/lldbmacros/ipc.py.PlR7YV): Not a directory
touch: /Users/Shared/BSA_10.10.1_rc1/BUILD/obj/RELEASE_X86_64/kernel.dSYM/Contents/Resources/Python/lldbmacros/: Not a directory
make[5]: [/users/Shared/BSA_10.10.1_rc1/BUILD/obj/RELEASE_X86_64/kernel.dSYM/Contents/Resources/Python/lldbmacros/structanalyze.py] Error 1 (ignored)
make[5]: [/users/Shared/BSA_10.10.1_rc1/BUILD/obj/RELEASE_X86_64/kernel.dSYM/Contents/Resources/Python/lldbmacros/ipc.py] Error 69 (ignored)
touch: /Users/Shared/BSA_10.10.1_rc1/BUILD/obj/RELEASE_X86_64/kernel.dSYM/Contents/Resources/Python/lldbmacros/: Not a directory
make[5]: [/users/Shared/BSA_10.10.1_rc1/BUILD/obj/RELEASE_X86_64/kernel.dSYM/Contents/Resources/Python/lldbmacros/scheduler.py] Error 1 (ignored)
mkdir: /Users/Shared/BSA_10.10.1_rc1/BUILD/obj/RELEASE_X86_64/kernel.dSYM/Contents/Resources/Python/lldbmacros/: Not a directory
make[5]: [/users/Shared/BSA_10.10.1_rc1/BUILD/obj/RELEASE_X86_64/kernel.dSYM/Contents/Resources/Python/lldbmacros/memory.py] Error 1 (ignored)
touch: /Users/Shared/BSA_10.10.1_rc1/BUILD/obj/RELEASE_X86_64/kernel.dSYM/Contents/Resources/Python/lldbmacros/: Not a directory
mkdir: /Users/Shared/BSA_10.10.1_rc1/BUILD/obj/RELEASE_X86_64/kernel.dSYM/Contents/Resources/Python/lldbmacros/: Not a directory
make[5]: [/users/Shared/BSA_10.10.1_rc1/BUILD/obj/RELEASE_X86_64/kernel.dSYM/Contents/Resources/Python/lldbmacros/ipc.py] Error 1 (ignored)
mkdir: /Users/Shared/BSA_10.10.1_rc1/BUILD/obj/RELEASE_X86_64/kernel.dSYM/Contents/Resources/Python/lldbmacros/: Not a directory
make[5]: [/users/Shared/BSA_10.10.1_rc1/BUILD/obj/RELEASE_X86_64/kernel.dSYM/Contents/Resources/Python/lldbmacros/net.py] Error 1 (ignored)mkdir:
/Users/Shared/BSA_10.10.1_rc1/BUILD/obj/RELEASE_X86_64/kernel.dSYM/Contents/Resources/Python/lldbmacros/: Not a directory
make[5]: [/users/Shared/BSA_10.10.1_rc1/BUILD/obj/RELEASE_X86_64/kernel.dSYM/Contents/Resources/Python/lldbmacros/ioreg.py] Error 1 (ignored)
make[5]: [/users/Shared/BSA_10.10.1_rc1/BUILD/obj/RELEASE_X86_64/kernel.dSYM/Contents/Resources/Python/lldbmacros/mbufs.py] Error 1 (ignored)
installfile: mkstemp(/Users/Shared/BSA_10.10.1_rc1/BUILD/obj/RELEASE_X86_64/kernel.dSYM/Contents/Resources/Python/lldbmacros/pmap.py.ZrBI5E): Not a directory
make[5]: [/users/Shared/BSA_10.10.1_rc1/BUILD/obj/RELEASE_X86_64/kernel.dSYM/Contents/Resources/Python/lldbmacros/pmap.py] Error 69 (ignored)
touch: /Users/Shared/BSA_10.10.1_rc1/BUILD/obj/RELEASE_X86_64/kernel.dSYM/Contents/Resources/Python/lldbmacros/: Not a directory
make[5]: [/users/Shared/BSA_10.10.1_rc1/BUILD/obj/RELEASE_X86_64/kernel.dSYM/Contents/Resources/Python/lldbmacros/pmap.py] Error 1 (ignored)
mkdir: /Users/Shared/BSA_10.10.1_rc1/BUILD/obj/RELEASE_X86_64/kernel.dSYM/Contents/Resources/Python/lldbmacros/: Not a directory
make[5]: [/users/Shared/BSA_10.10.1_rc1/BUILD/obj/RELEASE_X86_64/kernel.dSYM/Contents/Resources/Python/lldbmacros/utils.py] Error 1 (ignored)
installfile: mkstemp(/Users/Shared/BSA_10.10.1_rc1/BUILD/obj/RELEASE_X86_64/kernel.dSYM/Contents/Resources/Python/lldbmacros/memory.py.7UYXBc): Not a directory
make[5]: [/users/Shared/BSA_10.10.1_rc1/BUILD/obj/RELEASE_X86_64/kernel.dSYM/Contents/Resources/Python/lldbmacros/memory.py] Error 69 (ignored)
touch: /Users/Shared/BSA_10.10.1_rc1/BUILD/obj/RELEASE_X86_64/kernel.dSYM/Contents/Resources/Python/lldbmacros/: Not a directory
make[5]: [/users/Shared/BSA_10.10.1_rc1/BUILD/obj/RELEASE_X86_64/kernel.dSYM/Contents/Resources/Python/lldbmacros/memory.py] Error 1 (ignored)
mkdir: /Users/Shared/BSA_10.10.1_rc1/BUILD/obj/RELEASE_X86_64/kernel.dSYM/Contents/Resources/Python/lldbmacros/: Not a directory
make[5]: [/users/Shared/BSA_10.10.1_rc1/BUILD/obj/RELEASE_X86_64/kernel.dSYM/Contents/Resources/Python/lldbmacros/kdp.py] Error 1 (ignored)
installfile: mkstemp(/Users/Shared/BSA_10.10.1_rc1/BUILD/obj/RELEASE_X86_64/kernel.dSYM/Contents/Resources/Python/lldbmacros/ioreg.py.o271Ef): Not a directory
make[5]: [/users/Shared/BSA_10.10.1_rc1/BUILD/obj/RELEASE_X86_64/kernel.dSYM/Contents/Resources/Python/lldbmacros/ioreg.py] Error 69 (ignored)
touch: /Users/Shared/BSA_10.10.1_rc1/BUILD/obj/RELEASE_X86_64/kernel.dSYM/Contents/Resources/Python/lldbmacros/: Not a directory
make[5]: [/users/Shared/BSA_10.10.1_rc1/BUILD/obj/RELEASE_X86_64/kernel.dSYM/Contents/Resources/Python/lldbmacros/ioreg.py] Error 1 (ignored)
mkdir: /Users/Shared/BSA_10.10.1_rc1/BUILD/obj/RELEASE_X86_64/kernel.dSYM/Contents/Resources/Python/lldbmacros/: Not a directory
make[5]: [/users/Shared/BSA_10.10.1_rc1/BUILD/obj/RELEASE_X86_64/kernel.dSYM/Contents/Resources/Python/lldbmacros/process.py] Error 1 (ignored)
installfile: mkstemp(/Users/Shared/BSA_10.10.1_rc1/BUILD/obj/RELEASE_X86_64/kernel.dSYM/Contents/Resources/Python/lldbmacros/kdp.py.grxBBI): Not a directory
make[5]: [/users/Shared/BSA_10.10.1_rc1/BUILD/obj/RELEASE_X86_64/kernel.dSYM/Contents/Resources/Python/lldbmacros/kdp.py] Error 69 (ignored)
touch: /Users/Shared/BSA_10.10.1_rc1/BUILD/obj/RELEASE_X86_64/kernel.dSYM/Contents/Resources/Python/lldbmacros/: Not a directory
make[5]: [/users/Shared/BSA_10.10.1_rc1/BUILD/obj/RELEASE_X86_64/kernel.dSYM/Contents/Resources/Python/lldbmacros/kdp.py] Error 1 (ignored)
installfile: mkstemp(/Users/Shared/BSA_10.10.1_rc1/BUILD/obj/RELEASE_X86_64/kernel.dSYM/Contents/Resources/Python/lldbmacros/utils.py.yGQRMm): Not a directory
make[5]: [/users/Shared/BSA_10.10.1_rc1/BUILD/obj/RELEASE_X86_64/kernel.dSYM/Contents/Resources/Python/lldbmacros/utils.py] Error 69 (ignored)
mkdir: /Users/Shared/BSA_10.10.1_rc1/BUILD/obj/RELEASE_X86_64/kernel.dSYM/Contents/Resources/Python/lldbmacros/: Not a directory
make[5]: [/users/Shared/BSA_10.10.1_rc1/BUILD/obj/RELEASE_X86_64/kernel.dSYM/Contents/Resources/Python/lldbmacros/userspace.py] Error 1 (ignored)
touch: /Users/Shared/BSA_10.10.1_rc1/BUILD/obj/RELEASE_X86_64/kernel.dSYM/Contents/Resources/Python/lldbmacros/: Not a directory
make[5]: [/users/Shared/BSA_10.10.1_rc1/BUILD/obj/RELEASE_X86_64/kernel.dSYM/Contents/Resources/Python/lldbmacros/utils.py] Error 1 (ignored)
installfile: mkstemp(/Users/Shared/BSA_10.10.1_rc1/BUILD/obj/RELEASE_X86_64/kernel.dSYM/Contents/Resources/Python/lldbmacros/mbufs.py.XdX5FU): Not a directory
make[5]: [/users/Shared/BSA_10.10.1_rc1/BUILD/obj/RELEASE_X86_64/kernel.dSYM/Contents/Resources/Python/lldbmacros/mbufs.py] Error 69 (ignored)
mkdir: /Users/Shared/BSA_10.10.1_rc1/BUILD/obj/RELEASE_X86_64/kernel.dSYM/Contents/Resources/Python/lldbmacros/: Not a directory
make[5]: [/users/Shared/BSA_10.10.1_rc1/BUILD/obj/RELEASE_X86_64/kernel.dSYM/Contents/Resources/Python/lldbmacros/pci.py] Error 1 (ignored)
touch: /Users/Shared/BSA_10.10.1_rc1/BUILD/obj/RELEASE_X86_64/kernel.dSYM/Contents/Resources/Python/lldbmacros/: Not a directory
make[5]: [/users/Shared/BSA_10.10.1_rc1/BUILD/obj/RELEASE_X86_64/kernel.dSYM/Contents/Resources/Python/lldbmacros/mbufs.py] Error 1 (ignored)
installfile: mkstemp(/Users/Shared/BSA_10.10.1_rc1/BUILD/obj/RELEASE_X86_64/kernel.dSYM/Contents/Resources/Python/lldbmacros/net.py.6a2P7p): Not a directory
make[5]: [/users/Shared/BSA_10.10.1_rc1/BUILD/obj/RELEASE_X86_64/kernel.dSYM/Contents/Resources/Python/lldbmacros/net.py] Error 69 (ignored)
mkdir: /Users/Shared/BSA_10.10.1_rc1/BUILD/obj/RELEASE_X86_64/kernel.dSYM/Contents/Resources/Python/lldbmacros/: Not a directory
touch: /Users/Shared/BSA_10.10.1_rc1/BUILD/obj/RELEASE_X86_64/kernel.dSYM/Contents/Resources/Python/lldbmacros/: Not a directory
make[5]: [/users/Shared/BSA_10.10.1_rc1/BUILD/obj/RELEASE_X86_64/kernel.dSYM/Contents/Resources/Python/lldbmacros/net.py] Error 1 (ignored)
make[5]: [/users/Shared/BSA_10.10.1_rc1/BUILD/obj/RELEASE_X86_64/kernel.dSYM/Contents/Resources/Python/lldbmacros/misc.py] Error 1 (ignored)
installfile: mkstemp(/Users/Shared/BSA_10.10.1_rc1/BUILD/obj/RELEASE_X86_64/kernel.dSYM/Contents/Resources/Python/lldbmacros/process.py.MeqtlU): Not a directory
make[5]: [/users/Shared/BSA_10.10.1_rc1/BUILD/obj/RELEASE_X86_64/kernel.dSYM/Contents/Resources/Python/lldbmacros/process.py] Error 69 (ignored)
mkdir: /Users/Shared/BSA_10.10.1_rc1/BUILD/obj/RELEASE_X86_64/kernel.dSYM/Contents/Resources/Python/lldbmacros/: Not a directory
make[5]: [/users/Shared/BSA_10.10.1_rc1/BUILD/obj/RELEASE_X86_64/kernel.dSYM/Contents/Resources/Python/lldbmacros/apic.py] Error 1 (ignored)
touch: /Users/Shared/BSA_10.10.1_rc1/BUILD/obj/RELEASE_X86_64/kernel.dSYM/Contents/Resources/Python/lldbmacros/: Not a directory
make[5]: [/users/Shared/BSA_10.10.1_rc1/BUILD/obj/RELEASE_X86_64/kernel.dSYM/Contents/Resources/Python/lldbmacros/process.py] Error 1 (ignored)
mkdir: /Users/Shared/BSA_10.10.1_rc1/BUILD/obj/RELEASE_X86_64/kernel.dSYM/Contents/Resources/Python/: Not a directory
make[5]: [/users/Shared/BSA_10.10.1_rc1/BUILD/obj/RELEASE_X86_64/kernel.dSYM/Contents/Resources/Python/kernel.py] Error 1 (ignored)
installfile: mkstemp(/Users/Shared/BSA_10.10.1_rc1/BUILD/obj/RELEASE_X86_64/kernel.dSYM/Contents/Resources/Python/lldbmacros/userspace.py.bFT6Db): Not a directory
make[5]: [/users/Shared/BSA_10.10.1_rc1/BUILD/obj/RELEASE_X86_64/kernel.dSYM/Contents/Resources/Python/lldbmacros/userspace.py] Error 69 (ignored)
touch: /Users/Shared/BSA_10.10.1_rc1/BUILD/obj/RELEASE_X86_64/kernel.dSYM/Contents/Resources/Python/lldbmacros/: Not a directory
make[5]: [/users/Shared/BSA_10.10.1_rc1/BUILD/obj/RELEASE_X86_64/kernel.dSYM/Contents/Resources/Python/lldbmacros/userspace.py] Error 1 (ignored)
installfile: mkstemp(/Users/Shared/BSA_10.10.1_rc1/BUILD/obj/RELEASE_X86_64/kernel.dSYM/Contents/Resources/Python/lldbmacros/pci.py.53TWDM): Not a directory
make[5]: [/users/Shared/BSA_10.10.1_rc1/BUILD/obj/RELEASE_X86_64/kernel.dSYM/Contents/Resources/Python/lldbmacros/pci.py] Error 69 (ignored)
touch: /Users/Shared/BSA_10.10.1_rc1/BUILD/obj/RELEASE_X86_64/kernel.dSYM/Contents/Resources/Python/lldbmacros/: Not a directory
make[5]: [/users/Shared/BSA_10.10.1_rc1/BUILD/obj/RELEASE_X86_64/kernel.dSYM/Contents/Resources/Python/lldbmacros/pci.py] Error 1 (ignored)
installfile: mkstemp(/Users/Shared/BSA_10.10.1_rc1/BUILD/obj/RELEASE_X86_64/kernel.dSYM/Contents/Resources/Python/kernel.py.vG1WYo): Not a directory
make[5]: [/users/Shared/BSA_10.10.1_rc1/BUILD/obj/RELEASE_X86_64/kernel.dSYM/Contents/Resources/Python/kernel.py] Error 69 (ignored)
installfile: mkstemp(/Users/Shared/BSA_10.10.1_rc1/BUILD/obj/RELEASE_X86_64/kernel.dSYM/Contents/Resources/Python/lldbmacros/misc.py.uda2EE): Not a directory
make[5]: [/users/Shared/BSA_10.10.1_rc1/BUILD/obj/RELEASE_X86_64/kernel.dSYM/Contents/Resources/Python/lldbmacros/misc.py] Error 69 (ignored)
touch: /Users/Shared/BSA_10.10.1_rc1/BUILD/obj/RELEASE_X86_64/kernel.dSYM/Contents/Resources/Python/lldbmacros/: Not a directory
make[5]: [/users/Shared/BSA_10.10.1_rc1/BUILD/obj/RELEASE_X86_64/kernel.dSYM/Contents/Resources/Python/lldbmacros/misc.py] Error 1 (ignored)
installfile: mkstemp(/Users/Shared/BSA_10.10.1_rc1/BUILD/obj/RELEASE_X86_64/kernel.dSYM/Contents/Resources/Python/lldbmacros/apic.py.lQD37J): Not a directory
make[5]: [/users/Shared/BSA_10.10.1_rc1/BUILD/obj/RELEASE_X86_64/kernel.dSYM/Contents/Resources/Python/lldbmacros/apic.py] Error 69 (ignored)
touch: /Users/Shared/BSA_10.10.1_rc1/BUILD/obj/RELEASE_X86_64/kernel.dSYM/Contents/Resources/Python/lldbmacros/: Not a directory
make[5]: [/users/Shared/BSA_10.10.1_rc1/BUILD/obj/RELEASE_X86_64/kernel.dSYM/Contents/Resources/Python/lldbmacros/apic.py] Error 1 (ignored)
INSTALLSYM symbolset Libkern (x86_64)
INSTALLSYM symbolset IOKit (x86_64)
INSTALLSYM symbolset BSDKernel (x86_64)
installfile: open(/Users/Shared/BSA_10.10.1_rc1/BUILD/obj/RELEASE_X86_64/Libkern.symbolset): No such file or directory
installfile: open(/Users/Shared/BSA_10.10.1_rc1/BUILD/obj/RELEASE_X86_64/IOKit.symbolset): No such file or directory
make[4]: [/users/Shared/BSA_10.10.1_rc1/BUILD/sym/System.kext/PlugIns/Libkern.kext/Libkern] Error 66 (ignored)
make[4]: [/users/Shared/BSA_10.10.1_rc1/BUILD/sym/System.kext/PlugIns/IOKit.kext/IOKit] Error 66 (ignored)
installfile: open(/Users/Shared/BSA_10.10.1_rc1/BUILD/obj/RELEASE_X86_64/BSDKernel.symbolset): No such file or directory
make[4]: [/users/Shared/BSA_10.10.1_rc1/BUILD/sym/System.kext/PlugIns/BSDKernel.kext/BSDKernel] Error 66 (ignored)
INSTALLSYM symbolset Mach (x86_64)
INSTALLSYM symbolset MACFramework (x86_64)
installfile: open(/Users/Shared/BSA_10.10.1_rc1/BUILD/obj/RELEASE_X86_64/Mach.symbolset): No such file or directory
make[4]: [/users/Shared/BSA_10.10.1_rc1/BUILD/sym/System.kext/PlugIns/Mach.kext/Mach] Error 66 (ignored)
installfile: open(/Users/Shared/BSA_10.10.1_rc1/BUILD/obj/RELEASE_X86_64/MACFramework.symbolset): No such file or directory
make[4]: [/users/Shared/BSA_10.10.1_rc1/BUILD/sym/System.kext/PlugIns/MACFramework.kext/MACFramework] Error 66 (ignored)
INSTALLSYM symbolset Unsupported (x86_64)
installfile: open(/Users/Shared/BSA_10.10.1_rc1/BUILD/obj/RELEASE_X86_64/Unsupported.symbolset): No such file or directory
INSTALLSYM symbolset Private (x86_64)
make[4]: [/users/Shared/BSA_10.10.1_rc1/BUILD/sym/System.kext/PlugIns/Unsupported.kext/Unsupported] Error 66 (ignored)
INSTALLSYM kextplist System.kext/Info.plist
INSTALLSYM kextplist System.kext/PlugIns/AppleNMI.kext/Info.plist
installfile: open(/Users/Shared/BSA_10.10.1_rc1/BUILD/obj/RELEASE_X86_64/Private.symbolset): No such file or directory
make[4]: [/users/Shared/BSA_10.10.1_rc1/BUILD/sym/System.kext/PlugIns/Private.kext/Private] Error 66 (ignored)
INSTALLSYM kextplist System.kext/PlugIns/ApplePlatformFamily.kext/Info.plist
INSTALLSYM kextplist System.kext/PlugIns/IONVRAMFamily.kext/Info.plist
make[3]: *** No rule to make target `/Users/Shared/BSA_10.10.1_rc1/BUILD/obj/RELEASE_X86_64//kernel.dSYM/Contents/Info.plist', needed by `/Users/Shared/BSA_10.10.1_rc1/BUILD/sym/kernel.dSYM/Contents/Info.plist'.
make[3]: *** No rule to make target `/Users/Shared/BSA_10.10.1_rc1/BUILD/obj/RELEASE_X86_64//kernel.dSYM/Contents/Resources/Python/lldbmacros', needed by `/Users/Shared/BSA_10.10.1_rc1/BUILD/sym/kernel.dSYM/Contents/Resources/Python/lldbmacros'.
make[3]: *** No rule to make target `/Users/Shared/BSA_10.10.1_rc1/BUILD/obj/RELEASE_X86_64//kernel.dSYM/Contents/Resources/Python/kernel.py', needed by `/Users/Shared/BSA_10.10.1_rc1/BUILD/sym/kernel.dSYM/Contents/Resources/Python/kernel.py'.
make[3]: *** No rule to make target `/Users/Shared/BSA_10.10.1_rc1/BUILD/obj/RELEASE_X86_64//kernel.dSYM/Contents/Resources/DWARF/kernel', needed by `/Users/Shared/BSA_10.10.1_rc1/BUILD/sym/kernel.dSYM/Contents/Resources/DWARF/kernel'.
CC version.o
INSTALLSYM kextplist System.kext/PlugIns/IOSystemManagement.kext/Info.plist
INSTALLSYM kextplist System.kext/PlugIns/BSDKernel.kext/Info.plist
INSTALLSYM kextplist System.kext/PlugIns/IOKit.kext/Info.plist
INSTALLSYM kextplist System.kext/PlugIns/Libkern.kext/Info.plist
INSTALLSYM kextplist System.kext/PlugIns/Mach.kext/Info.plist
LD kernel.unstripped
INSTALLSYM kextplist System.kext/PlugIns/MACFramework.kext/Info.plist
INSTALLSYM kextplist System.kext/PlugIns/Unsupported.kext/Info.plist
INSTALLSYM kextplist System.kext/PlugIns/Private.kext/Info.plist
INSTALL BSDKernel (x86_64)
installfile: open(/Users/Shared/BSA_10.10.1_rc1/BUILD/sym/System.kext/PlugIns/BSDKernel.kext/BSDKernel): No such file or directory
make[4]: [/users/Shared/BSA_10.10.1_rc1/BUILD/dst/System/Library/Extensions/System.kext/PlugIns/BSDKernel.kext/BSDKernel] Error 66 (ignored)
INSTALL IOKit (x86_64)
installfile: open(/Users/Shared/BSA_10.10.1_rc1/BUILD/sym/System.kext/PlugIns/IOKit.kext/IOKit): No such file or directory
make[4]: [/users/Shared/BSA_10.10.1_rc1/BUILD/dst/System/Library/Extensions/System.kext/PlugIns/IOKit.kext/IOKit] Error 66 (ignored)
INSTALL Libkern (x86_64)
INSTALL Mach (x86_64)
INSTALL MACFramework (x86_64)
INSTALL Unsupported (x86_64)
installfile: open(/Users/Shared/BSA_10.10.1_rc1/BUILD/sym/System.kext/PlugIns/Libkern.kext/Libkern): No such file or directory
make[4]: [/users/Shared/BSA_10.10.1_rc1/BUILD/dst/System/Library/Extensions/System.kext/PlugIns/Libkern.kext/Libkern] Error 66 (ignored)
installfile: open(/Users/Shared/BSA_10.10.1_rc1/BUILD/sym/System.kext/PlugIns/Mach.kext/Mach): No such file or directory
installfile: open(/Users/Shared/BSA_10.10.1_rc1/BUILD/sym/System.kext/PlugIns/MACFramework.kext/MACFramework): No such file or directory
make[4]: [/users/Shared/BSA_10.10.1_rc1/BUILD/dst/System/Library/Extensions/System.kext/PlugIns/Mach.kext/Mach] Error 66 (ignored)
make[4]: [/users/Shared/BSA_10.10.1_rc1/BUILD/dst/System/Library/Extensions/System.kext/PlugIns/MACFramework.kext/MACFramework] Error 66 (ignored)
installfile: open(/Users/Shared/BSA_10.10.1_rc1/BUILD/sym/System.kext/PlugIns/Unsupported.kext/Unsupported): No such file or directory
make[4]: [/users/Shared/BSA_10.10.1_rc1/BUILD/dst/System/Library/Extensions/System.kext/PlugIns/Unsupported.kext/Unsupported] Error 66 (ignored)
INSTALL kextplist System.kext/Info.plist
INSTALL Private (x86_64)
INSTALL kextplist System.kext/PlugIns/ApplePlatformFamily.kext/Info.plist
INSTALL kextplist System.kext/PlugIns/AppleNMI.kext/Info.plist
installfile: open(/Users/Shared/BSA_10.10.1_rc1/BUILD/sym/System.kext/PlugIns/Private.kext/Private): No such file or directory
make[4]: [/users/Shared/BSA_10.10.1_rc1/BUILD/dst/System/Library/Extensions/System.kext/PlugIns/Private.kext/Private] Error 66 (ignored)
INSTALL kextplist System.kext/PlugIns/IONVRAMFamily.kext/Info.plist
INSTALL kextplist System.kext/PlugIns/IOSystemManagement.kext/Info.plist
INSTALL kextplist System.kext/PlugIns/BSDKernel.kext/Info.plist
INSTALL kextplist System.kext/PlugIns/IOKit.kext/Info.plist
INSTALL kextplist System.kext/PlugIns/Libkern.kext/Info.plist
INSTALL kextplist System.kext/PlugIns/Mach.kext/Info.plist
INSTALL kextplist System.kext/PlugIns/MACFramework.kext/Info.plist
INSTALL kextplist System.kext/PlugIns/Unsupported.kext/Info.plist
INSTALL kextplist System.kext/PlugIns/Private.kext/Info.plist
INSTALL SupportedKPIs-x86_64.txt
INSTALL SupportedKPIs-all-archs.txt
undef: _opemu_utrap
undef: _opemu_ktrap
undef: _BF_set_key
undef: _BF_encrypt
undef: _BF_decrypt
Undefined symbols for architecture x86_64:
"_opemu_utrap", referenced from:
_user_trap in trap.o
"_opemu_ktrap", referenced from:
_kernel_trap in trap.o
"_BF_set_key", referenced from:
_ink_decrypt in page_decrypt.o
"_BF_encrypt", referenced from:
_BF_cbc_encrypt in page_decrypt.o
"_BF_decrypt", referenced from:
_BF_cbc_encrypt in page_decrypt.o
ld: symbol(s) not found for architecture x86_64
clang: error: linker command failed with exit code 1 (use -v to see invocation)
make[3]: [/users/Shared/BSA_10.10.1_rc1/BUILD/obj/RELEASE_X86_64//kernel.unstripped] Error 1 (ignored)
STRIP kernel
error: /Applications/Xcode.app/Contents/Developer/Toolchains/XcodeDefault.xctoolchain/usr/bin/strip: can't open file: /Users/Shared/BSA_10.10.1_rc1/BUILD/obj/RELEASE_X86_64//kernel.unstripped (No such file or directory)
make[3]: [/users/Shared/BSA_10.10.1_rc1/BUILD/obj/RELEASE_X86_64//kernel] Error 1 (ignored)
CTFMERGE kernel
INSTALLSYM kernel (x86_64)
installfile: open(/Users/Shared/BSA_10.10.1_rc1/BUILD/obj/RELEASE_X86_64//kernel.unstripped): No such file or directory
make[3]: [/users/Shared/BSA_10.10.1_rc1/BUILD/sym/kernel] Error 66 (ignored)
ERROR: ctfmerge: Cannot open output file /Users/Shared/BSA_10.10.1_rc1/BUILD/obj/RELEASE_X86_64//kernel for r/w: No such file or directory
INSTALL kernel (x86_64 none)
installfile: open(/Users/Shared/BSA_10.10.1_rc1/BUILD/obj/RELEASE_X86_64//kernel): No such file or directory
make[3]: [/users/Shared/BSA_10.10.1_rc1/BUILD/dst//System/Library/Kernels/kernel] Error 66 (ignored)
make[3]: Target `do_build_install_primary' not remade because of errors.
make[2]: [build_install_primary] Error 2 (ignored)
georges-imac:BSA_10.10.1_rc1 mein$

 

 

 

here are my problems, with:

 

 

 

 

ERROR: mptcp_usrreq.c: die 25750: no attr 0x49

 

undef: _opemu_utrap
undef: _opemu_ktrap
undef: _BF_set_key
undef: _BF_encrypt
undef: _BF_decrypt
Undefined symbols for architecture x86_64:
"_opemu_utrap", referenced from:
_user_trap in trap.o
"_opemu_ktrap", referenced from:
_kernel_trap in trap.o
"_BF_set_key", referenced from:
_ink_decrypt in page_decrypt.o
"_BF_encrypt", referenced from:
_BF_cbc_encrypt in page_decrypt.o
"_BF_decrypt", referenced from:
_BF_cbc_encrypt in page_decrypt.o

ld: symbol(s) not found for architecture x86_64
clang: error: linker command failed with exit code 1 (use -v to see invocation)
make[3]: [/users/Shared/BSA_10.10.1_rc1/BUILD/obj/RELEASE_X86_64//kernel.unstripped] Error 1 (ignored)

STRIP kernel
DSYMUTIL kernel.dSYM
error: /Applications/Xcode.app/Contents/Developer/Toolchains/XcodeDefault.xctoolchain/usr/bin/strip: can't open file: /Users/Shared/BSA_10.10.1_rc1/BUILD/obj/RELEASE_X86_64//kernel.unstripped (No such file or directory)
make[3]: [/users/Shared/BSA_10.10.1_rc1/BUILD/obj/RELEASE_X86_64//kernel] Error 1 (ignored)

CTFMERGE kernel
error: unable to open executable '/Users/Shared/BSA_10.10.1_rc1/BUILD/obj/RELEASE_X86_64//kernel.unstripped'
make[3]: [/users/Shared/BSA_10.10.1_rc1/BUILD/obj/RELEASE_X86_64//kernel.dSYM] Error 1 (ignored)
mv: rename /Users/Shared/BSA_10.10.1_rc1/BUILD/obj/RELEASE_X86_64//kernel.dSYM/Contents/Resources/DWARF/kernel.unstripped to /Users/Shared/BSA_10.10.1_rc1/BUILD/obj/RELEASE_X86_64//kernel.dSYM/Contents/Resources/DWARF/kernel: No such file or directory
make[3]: [/users/Shared/BSA_10.10.1_rc1/BUILD/obj/RELEASE_X86_64//kernel.dSYM] Error 1 (ignored)
ERROR: ctfmerge: Cannot open output file /Users/Shared/BSA_10.10.1_rc1/BUILD/obj/RELEASE_X86_64//kernel for r/w: No such file or directory
make[4]: *** No rule to make target `/Users/Shared/BSA_10.10.1_rc1/BUILD/obj/RELEASE_X86_64/kernel', needed by `/Users/Shared/BSA_10.10.1_rc1/BUILD/obj/RELEASE_X86_64/allsymbols'.

SUPPORTED_KPI (x86_64)
SUPPORTED_KPI (all)
mkdir: /Users/Shared/BSA_10.10.1_rc1/BUILD/obj/RELEASE_X86_64/kernel.dSYM/Contents/Resources/Python/lldbmacros/core/: Not a directory
make[5]: [/users/Shared/BSA_10.10.1_rc1/BUILD/obj/RELEASE_X86_64/kernel.dSYM/Contents/Resources/Python/lldbmacros/core/standard.py] Error 1 (ignored)
mkdir: /Users/Shared/BSA_10.10.1_rc1/BUILD/obj/RELEASE_X86_64/kernel.dSYM/Contents/Resources/Python/lldbmacros/core/: Not a directory
make[5]: [/users/Shared/BSA_10.10.1_rc1/BUILD/obj/RELEASE_X86_64/kernel.dSYM/Contents/Resources/Python/lldbmacros/core/cvalue.py] Error 1 (ignored)
mkdir: /Users/Shared/BSA_10.10.1_rc1/BUILD/obj/RELEASE_X86_64/kernel.dSYM/Contents/Resources/Python/lldbmacros/core/: Not a directory
make[5]: [/users/Shared/BSA_10.10.1_rc1/BUILD/obj/RELEASE_X86_64/kernel.dSYM/Contents/Resources/Python/lldbmacros/core/__init__.py] Error 1 (ignored)
mkdir: /Users/Shared/BSA_10.10.1_rc1/BUILD/obj/RELEASE_X86_64/kernel.dSYM/Contents/Resources/Python/lldbmacros/core/: Not a directory
make[5]: [/users/Shared/BSA_10.10.1_rc1/BUILD/obj/RELEASE_X86_64/kernel.dSYM/Contents/Resources/Python/lldbmacros/core/configuration.py] Error 1 (ignored)
make[4]: Target `do_config_all' not remade because of errors.
make[3]: [config_all] Error 2 (ignored)
mkdir: /Users/Shared/BSA_10.10.1_rc1/BUILD/obj/RELEASE_X86_64/kernel.dSYM/Contents/Resources/Python/lldbmacros/core/: Not a directory
make[5]: [/users/Shared/BSA_10.10.1_rc1/BUILD/obj/RELEASE_X86_64/kernel.dSYM/Contents/Resources/Python/lldbmacros/core/caching.py] Error 1 (ignored)
installfile: installfile: mkstemp(/Users/Shared/BSA_10.10.1_rc1/BUILD/obj/RELEASE_X86_64/kernel.dSYM/Contents/Resources/Python/lldbmacros/core/__init__.py.hDtNIP): mkstemp(/Users/Shared/BSA_10.10.1_rc1/BUILD/obj/RELEASE_X86_64/kernel.dSYM/Contents/Resources/Python/lldbmacros/core/caching.py.3ZR6hx)Not a directory
: Not a directory
installfile: mkstemp(/Users/Shared/BSA_10.10.1_rc1/BUILD/obj/RELEASE_X86_64/kernel.dSYM/Contents/Resources/Python/lldbmacros/core/configuration.py.htmwEH): Not a directory
make[5]: [/users/Shared/BSA_10.10.1_rc1/BUILD/obj/RELEASE_X86_64/kernel.dSYM/Contents/Resources/Python/lldbmacros/core/__init__.py] Error 69 (ignored)
make[5]: [/users/Shared/BSA_10.10.1_rc1/BUILD/obj/RELEASE_X86_64/kernel.dSYM/Contents/Resources/Python/lldbmacros/core/caching.py] Error 69 (ignored)
installfile: mkstemp(/Users/Shared/BSA_10.10.1_rc1/BUILD/obj/RELEASE_X86_64/kernel.dSYM/Contents/Resources/Python/lldbmacros/core/cvalue.py.hnu6Pk): Not a directory
installfile: mkstemp(/Users/Shared/BSA_10.10.1_rc1/BUILD/obj/RELEASE_X86_64/kernel.dSYM/Contents/Resources/Python/lldbmacros/core/standard.py.4VimL5): Not a directory
make[5]: [/users/Shared/BSA_10.10.1_rc1/BUILD/obj/RELEASE_X86_64/kernel.dSYM/Contents/Resources/Python/lldbmacros/core/cvalue.py] Error 69 (ignored)
make[5]: [/users/Shared/BSA_10.10.1_rc1/BUILD/obj/RELEASE_X86_64/kernel.dSYM/Contents/Resources/Python/lldbmacros/core/standard.py] Error 69 (ignored)
touch: /Users/Shared/BSA_10.10.1_rc1/BUILD/obj/RELEASE_X86_64/kernel.dSYM/Contents/Resources/Python/lldbmacros/: Not a directory
touch: /Users/Shared/BSA_10.10.1_rc1/BUILD/obj/RELEASE_X86_64/kernel.dSYM/Contents/Resources/Python/lldbmacros/: Not a directory
make[5]: [/users/Shared/BSA_10.10.1_rc1/BUILD/obj/RELEASE_X86_64/kernel.dSYM/Contents/Resources/Python/lldbmacros/core/caching.py] Error 1 (ignored)
make[5]: [/users/Shared/BSA_10.10.1_rc1/BUILD/obj/RELEASE_X86_64/kernel.dSYM/Contents/Resources/Python/lldbmacros/core/__init__.py] Error 1 (ignored)
make[5]: [/users/Shared/BSA_10.10.1_rc1/BUILD/obj/RELEASE_X86_64/kernel.dSYM/Contents/Resources/Python/lldbmacros/core/configuration.py] Error 69 (ignored)
touch: /Users/Shared/BSA_10.10.1_rc1/BUILD/obj/RELEASE_X86_64/kernel.dSYM/Contents/Resources/Python/lldbmacros/: Not a directory
make[5]: [/users/Shared/BSA_10.10.1_rc1/BUILD/obj/RELEASE_X86_64/kernel.dSYM/Contents/Resources/Python/lldbmacros/core/cvalue.py] Error 1 (ignored)
touch: /Users/Shared/BSA_10.10.1_rc1/BUILD/obj/RELEASE_X86_64/kernel.dSYM/Contents/Resources/Python/lldbmacros/: Not a directory
make[5]: [/users/Shared/BSA_10.10.1_rc1/BUILD/obj/RELEASE_X86_64/kernel.dSYM/Contents/Resources/Python/lldbmacros/core/standard.py] Error 1 (ignored)
touch: /Users/Shared/BSA_10.10.1_rc1/BUILD/obj/RELEASE_X86_64/kernel.dSYM/Contents/Resources/Python/lldbmacros/: Not a directory
make[5]: [/users/Shared/BSA_10.10.1_rc1/BUILD/obj/RELEASE_X86_64/kernel.dSYM/Contents/Resources/Python/lldbmacros/core/configuration.py] Error 1 (ignored)
mkdir: /Users/Shared/BSA_10.10.1_rc1/BUILD/obj/RELEASE_X86_64/kernel.dSYM/Contents/Resources/Python/lldbmacros/core/: Not a directory
make[5]: [/users/Shared/BSA_10.10.1_rc1/BUILD/obj/RELEASE_X86_64/kernel.dSYM/Contents/Resources/Python/lldbmacros/core/lazytarget.py] Error 1 (ignored)
mkdir: /Users/Shared/BSA_10.10.1_rc1/BUILD/obj/RELEASE_X86_64/kernel.dSYM/Contents/Resources/Python/lldbmacros/core/: Not a directory
make[5]: [/users/Shared/BSA_10.10.1_rc1/BUILD/obj/RELEASE_X86_64/kernel.dSYM/Contents/Resources/Python/lldbmacros/core/kernelcore.py] Error 1 (ignored)
mkdir: /Users/Shared/BSA_10.10.1_rc1/BUILD/obj/RELEASE_X86_64/kernel.dSYM/Contents/Resources/Python/lldbmacros/core/: Not a directory
make[5]: [/users/Shared/BSA_10.10.1_rc1/BUILD/obj/RELEASE_X86_64/kernel.dSYM/Contents/Resources/Python/lldbmacros/core/operating_system.py] Error 1 (ignored)
mkdir: /Users/Shared/BSA_10.10.1_rc1/BUILD/obj/RELEASE_X86_64/kernel.dSYM/Contents/Resources/Python/lldbmacros/core/: Not a directory
make[5]: [/users/Shared/BSA_10.10.1_rc1/BUILD/obj/RELEASE_X86_64/kernel.dSYM/Contents/Resources/Python/lldbmacros/core/xnu_lldb_init.py] Error 1 (ignored)
mkdir: /Users/Shared/BSA_10.10.1_rc1/BUILD/obj/RELEASE_X86_64/kernel.dSYM/Contents/Resources/Python/lldbmacros/plugins/: Not a directory
make[5]: [/users/Shared/BSA_10.10.1_rc1/BUILD/obj/RELEASE_X86_64/kernel.dSYM/Contents/Resources/Python/lldbmacros/plugins/__init__.py] Error 1 (ignored)
installfile: mkstemp(/Users/Shared/BSA_10.10.1_rc1/BUILD/obj/RELEASE_X86_64/kernel.dSYM/Contents/Resources/Python/lldbmacros/core/kernelcore.py.hyMbkF): Not a directory
make[5]: [/users/Shared/BSA_10.10.1_rc1/BUILD/obj/RELEASE_X86_64/kernel.dSYM/Contents/Resources/Python/lldbmacros/core/kernelcore.py] Error 69 (ignored)
touch: /Users/Shared/BSA_10.10.1_rc1/BUILD/obj/RELEASE_X86_64/kernel.dSYM/Contents/Resources/Python/lldbmacros/: Not a directory
make[5]: [/users/Shared/BSA_10.10.1_rc1/BUILD/obj/RELEASE_X86_64/kernel.dSYM/Contents/Resources/Python/lldbmacros/core/kernelcore.py] Error 1 (ignored)
mkdir: /Users/Shared/BSA_10.10.1_rc1/BUILD/obj/RELEASE_X86_64/kernel.dSYM/Contents/Resources/Python/lldbmacros/plugins/: Not a directory
make[5]: [/users/Shared/BSA_10.10.1_rc1/BUILD/obj/RELEASE_X86_64/kernel.dSYM/Contents/Resources/Python/lldbmacros/plugins/zprint_perf_log.py] Error 1 (ignored)
installfile: mkstemp(/Users/Shared/BSA_10.10.1_rc1/BUILD/obj/RELEASE_X86_64/kernel.dSYM/Contents/Resources/Python/lldbmacros/core/xnu_lldb_init.py.8vYxC0): Not a directory
make[5]: [/users/Shared/BSA_10.10.1_rc1/BUILD/obj/RELEASE_X86_64/kernel.dSYM/Contents/Resources/Python/lldbmacros/core/xnu_lldb_init.py] Error 69 (ignored)
installfile: mkstemp(/Users/Shared/BSA_10.10.1_rc1/BUILD/obj/RELEASE_X86_64/kernel.dSYM/Contents/Resources/Python/lldbmacros/core/lazytarget.py.vU8t7I): Not a directory
make[5]: [/users/Shared/BSA_10.10.1_rc1/BUILD/obj/RELEASE_X86_64/kernel.dSYM/Contents/Resources/Python/lldbmacros/core/lazytarget.py] Error 69 (ignored)touch:
/Users/Shared/BSA_10.10.1_rc1/BUILD/obj/RELEASE_X86_64/kernel.dSYM/Contents/Resources/Python/lldbmacros/: Not a directory
make[5]: [/users/Shared/BSA_10.10.1_rc1/BUILD/obj/RELEASE_X86_64/kernel.dSYM/Contents/Resources/Python/lldbmacros/core/xnu_lldb_init.py] Error 1 (ignored)
touch: /Users/Shared/BSA_10.10.1_rc1/BUILD/obj/RELEASE_X86_64/kernel.dSYM/Contents/Resources/Python/lldbmacros/: Not a directory
installfile: make[5]: mkstemp(/Users/Shared/BSA_10.10.1_rc1/BUILD/obj/RELEASE_X86_64/kernel.dSYM/Contents/Resources/Python/lldbmacros/plugins/__init__.py.7d9zIp)[/users/Shared/BSA_10.10.1_rc1/BUILD/obj/RELEASE_X86_64/kernel.dSYM/Contents/Resources/Python/lldbmacros/core/lazytarget.py] Error 1 (ignored):
Not a directory
mkdir: /Users/Shared/BSA_10.10.1_rc1/BUILD/obj/RELEASE_X86_64/kernel.dSYM/Contents/Resources/Python/lldbmacros/: Not a directory
make[5]: [/users/Shared/BSA_10.10.1_rc1/BUILD/obj/RELEASE_X86_64/kernel.dSYM/Contents/Resources/Python/lldbmacros/atm.py] Error 1 (ignored)
make[5]: [/users/Shamkdir: red/BSA_10.10.1_rc1/BUILD/obj/RELEASE_X86_64/kernel.dSYM/Contents/Resources/Python/lldbmacros/plugins/__init__.py] Error 69 (ignored)
/Users/Shared/BSA_10.10.1_rc1/BUILD/obj/RELEASE_X86_64/kernel.dSYM/Contents/Resources/Python/lldbmacros/: Not a directory
make[5]: [/users/Shared/BSA_10.10.1_rc1/BUILD/obj/RELEASE_X86_64/kernel.dSYM/Contents/Resources/Python/lldbmacros/bank.py] Error 1 (ignored)
touch: /Users/Shared/BSA_10.10.1_rc1/BUILD/obj/RELEASE_X86_64/kernel.dSYM/Contents/Resources/Python/lldbmacros/: Not a directory
installfile: mkstemp(/Users/Shared/BSA_10.10.1_rc1/BUILD/obj/RELEASE_X86_64/kernel.dSYM/Contents/Resources/Python/lldbmacros/atm.py.eZeklS): Not a directory
make[5]: [/users/Shared/BSA_10.10.1_rc1/BUILD/obj/RELEASE_X86_64/kernel.dSYM/Contents/Resources/Python/lldbmacros/atm.py] Error 69 (ignored)
make[5]: [/users/Shared/BSA_10.10.1_rc1/BUILD/obj/RELEASE_X86_64/kernel.dSYM/Contents/Resources/Python/lldbmacros/plugins/__init__.py] Error 1 (ignored)
installfile: mkstemp(/Users/Shared/BSA_10.10.1_rc1/BUILD/obj/RELEASE_X86_64/kernel.dSYM/Contents/Resources/Python/lldbmacros/plugins/zprint_perf_log.py.pNiiMd): Not a directory
make[5]: [/users/Shared/BSA_10.10.1_rc1/BUILD/obj/RELEASE_X86_64/kernel.dSYM/Contents/Resources/Python/lldbmacros/plugins/zprint_perf_log.py] Error 69 (ignored)
installfile: mkstemp(/Users/Shared/BSA_10.10.1_rc1/BUILD/obj/RELEASE_X86_64/kernel.dSYM/Contents/Resources/Python/lldbmacros/core/operating_system.py.Ss4P3E): Not a directory
touch: make[5]: /Users/Shared/BSA_10.10.1_rc1/BUILD/obj/RELEASE_X86_64/kernel.dSYM/Contents/Resources/Python/lldbmacros/[/users/Shared/BSA_10.10.1_rc1/BUILD/obj/RELEASE_X86_64/kernel.dSYM/Contents/Resources/Python/lldbmacros/core/operating_system.py] Error 69 (ignored):
Not a directory
mkdir: /Users/Shared/BSA_10.10.1_rc1/BUILD/obj/RELEASE_X86_64/kernel.dSYM/Contents/Resources/Python/lldbmacros/: Not a directory
make[5]: [/users/Shared/BSA_10.10.1_rc1/BUILD/obj/RELEASE_X86_64/kernel.dSYM/Contents/Resources/Python/lldbmacros/atm.py] Error 1 (ignored)
make[5]: [/users/Shared/BSA_10.10.1_rc1/BUILD/obj/RELEASE_X86_64/kernel.dSYM/Contents/Resources/Python/lldbmacros/xnu.py] Error 1 (ignored)
touch: /Users/Shared/BSA_10.10.1_rc1/BUILD/obj/RELEASE_X86_64/kernel.dSYM/Contents/Resources/Python/lldbmacros/: Not a directory
touch: /Users/Shared/BSA_10.10.1_rc1/BUILD/obj/RELEASE_X86_64/kernel.dSYM/Contents/Resources/Python/lldbmacros/: Not a directory
make[5]: [/users/Shared/BSA_10.10.1_rc1/BUILD/obj/RELEASE_X86_64/kernel.dSYM/Contents/Resources/Python/lldbmacros/plugins/zprint_perf_log.py] Error 1 (ignored)
make[5]: [/users/Shared/BSA_10.10.1_rc1/BUILD/obj/RELEASE_X86_64/kernel.dSYM/Contents/Resources/Python/lldbmacros/core/operating_system.py] Error 1 (ignored)
mkdir: /Users/Shared/BSA_10.10.1_rc1/BUILD/obj/RELEASE_X86_64/kernel.dSYM/Contents/Resources/Python/lldbmacros/: Not a directory
make[5]: [/users/Shared/BSA_10.10.1_rc1/BUILD/obj/RELEASE_X86_64/kernel.dSYM/Contents/Resources/Python/lldbmacros/xnudefines.py] Error 1 (ignored)
mkdir: /Users/Shared/BSA_10.10.1_rc1/BUILD/obj/RELEASE_X86_64/kernel.dSYM/Contents/Resources/Python/lldbmacros/: Not a directory
make[5]: [/users/Shared/BSA_10.10.1_rc1/BUILD/obj/RELEASE_X86_64/kernel.dSYM/Contents/Resources/Python/lldbmacros/mbufdefines.py] Error 1 (ignored)
mkdir: /Users/Shared/BSA_10.10.1_rc1/BUILD/obj/RELEASE_X86_64/kernel.dSYM/Contents/Resources/Python/lldbmacros/: Not a directory
make[5]: [/users/Shared/BSA_10.10.1_rc1/BUILD/obj/RELEASE_X86_64/kernel.dSYM/Contents/Resources/Python/lldbmacros/netdefines.py] Error 1 (ignored)
installfile: mkstemp(/Users/Shared/BSA_10.10.1_rc1/BUILD/obj/RELEASE_X86_64/kernel.dSYM/Contents/Resources/Python/lldbmacros/bank.py.J5Zt4D): Not a directory
make[5]: [/users/Shared/BSA_10.10.1_rc1/BUILD/obj/RELEASE_X86_64/kernel.dSYM/Contents/Resources/Python/lldbmacros/bank.py] Error 69 (ignored)
touch: /Users/Shared/BSA_10.10.1_rc1/BUILD/obj/RELEASE_X86_64/kernel.dSYM/Contents/Resources/Python/lldbmacros/: Not a directory
make[5]: [/users/Shared/BSA_10.10.1_rc1/BUILD/obj/RELEASE_X86_64/kernel.dSYM/Contents/Resources/Python/lldbmacros/bank.py] Error 1 (ignored)
mkdir: /Users/Shared/BSA_10.10.1_rc1/BUILD/obj/RELEASE_X86_64/kernel.dSYM/Contents/Resources/Python/lldbmacros/: Not a directory
make[5]: [/users/Shared/BSA_10.10.1_rc1/BUILD/obj/RELEASE_X86_64/kernel.dSYM/Contents/Resources/Python/lldbmacros/routedefines.py] Error 1 (ignored)
installfile: mkstemp(/Users/Shared/BSA_10.10.1_rc1/BUILD/obj/RELEASE_X86_64/kernel.dSYM/Contents/Resources/Python/lldbmacros/mbufdefines.py.KPphoS): Not a directory
installfile: mkstemp(/Users/Shared/BSA_10.10.1_rc1/BUILD/obj/RELEASE_X86_64/kernel.dSYM/Contents/Resources/Python/lldbmacros/xnudefines.py.zA9vVx): make[5]: Not a directory
[/users/Shared/BSA_10.10.1_rc1/BUILD/obj/RELEASE_X86_64/kernel.dSYM/Contents/Resources/Python/lldbmacros/mbufdefines.py] Error 69 (ignored)
make[5]: [/users/Shared/BSA_10.10.1_rc1/BUILD/obj/RELEASE_X86_64/kernel.dSYM/Contents/Resources/Python/lldbmacros/xnudefines.py] Error 69 (ignored)
touch: /Users/Shared/BSA_10.10.1_rc1/BUILD/obj/RELEASE_X86_64/kernel.dSYM/Contents/Resources/Python/lldbmacros/: Not a directory
make[5]: [/users/Shared/BSA_10.10.1_rc1/BUILD/obj/RELEASE_X86_64/kernel.dSYM/Contents/Resources/Python/lldbmacros/mbufdefines.py] Error 1 (ignored)
touch: /Users/Shared/BSA_10.10.1_rc1/BUILD/obj/RELEASE_X86_64/kernel.dSYM/Contents/Resources/Python/lldbmacros/: Not a directory
make[5]: [/users/Shared/BSA_10.10.1_rc1/BUILD/obj/RELEASE_X86_64/kernel.dSYM/Contents/Resources/Python/lldbmacros/xnudefines.py] Error 1 (ignored)
mkdir: /Users/Shared/BSA_10.10.1_rc1/BUILD/obj/RELEASE_X86_64/kernel.dSYM/Contents/Resources/Python/lldbmacros/: Not a directory
make[5]: [/users/Shared/BSA_10.10.1_rc1/BUILD/obj/RELEASE_X86_64/kernel.dSYM/Contents/Resources/Python/lldbmacros/ipc.py] Error 1 (ignored)
mkdir: /Users/Shared/BSA_10.10.1_rc1/BUILD/obj/RELEASE_X86_64/kernel.dSYM/Contents/Resources/Python/lldbmacros/: Not a directory
make[5]: [/users/Shared/BSA_10.10.1_rc1/BUILD/obj/RELEASE_X86_64/kernel.dSYM/Contents/Resources/Python/lldbmacros/ipcimportancedetail.py] Error 1 (ignored)
installfile: mkstemp(/Users/Shared/BSA_10.10.1_rc1/BUILD/obj/RELEASE_X86_64/kernel.dSYM/Contents/Resources/Python/lldbmacros/routedefines.py.BJP02I): Not a directory
installfile: mkstemp(/Users/Shared/BSA_10.10.1_rc1/BUILD/obj/RELEASE_X86_64/kernel.dSYM/Contents/Resources/Python/lldbmacros/xnu.py.flgz0z): Not a directory
make[5]: [/users/Shared/BSA_10.10.1_rc1/BUILD/obj/RELEASE_X86_64/kernel.dSYM/Contents/Resources/Python/lldbmacros/routedefines.py] Error 69 (ignored)
make[5]: [/users/Shared/BSA_10.10.1_rc1/BUILD/obj/RELEASE_X86_64/kernel.dSYM/Contents/Resources/Python/lldbmacros/xnu.py] Error 69 (ignored)
touch: /Users/Shared/BSA_10.10.1_rc1/BUILD/obj/RELEASE_X86_64/kernel.dSYM/Contents/Resources/Python/lldbmacros/: Not a directory
touch: make[5]: /Users/Shared/BSA_10.10.1_rc1/BUILD/obj/RELEASE_X86_64/kernel.dSYM/Contents/Resources/Python/lldbmacros/[/users/Shared/BSA_10.10.1_rc1/BUILD/obj/RELEASE_X86_64/kernel.dSYM/Contents/Resources/Python/lldbmacros/routedefines.py] Error 1 (ignored):
Not a directory
make[5]: [/users/Shared/BSA_10.10.1_rc1/BUILD/obj/RELEASE_X86_64/kernel.dSYM/Contents/Resources/Python/lldbmacros/xnu.py] Error 1 (ignored)
mkdir: /Users/Shared/BSA_10.10.1_rc1/BUILD/obj/RELEASE_X86_64/kernel.dSYM/Contents/Resources/Python/lldbmacros/: Not a directory
make[5]: [/users/Shared/BSA_10.10.1_rc1/BUILD/obj/RELEASE_X86_64/kernel.dSYM/Contents/Resources/Python/lldbmacros/scheduler.py] Error 1 (ignored)
mkdir: /Users/Shared/BSA_10.10.1_rc1/BUILD/obj/RELEASE_X86_64/kernel.dSYM/Contents/Resources/Python/lldbmacros/: Not a directory
make[5]: [/users/Shared/BSA_10.10.1_rc1/BUILD/obj/RELEASE_X86_64/kernel.dSYM/Contents/Resources/Python/lldbmacros/structanalyze.py] Error 1 (ignored)
installfile: mkstemp(/Users/Shared/BSA_10.10.1_rc1/BUILD/obj/RELEASE_X86_64/kernel.dSYM/Contents/Resources/Python/lldbmacros/netdefines.py.JrYhCr): Not a directory
make[5]: [/users/Shared/BSA_10.10.1_rc1/BUILD/obj/RELEASE_X86_64/kernel.dSYM/Contents/Resources/Python/lldbmacros/netdefines.py] Error 69 (ignored)
touch: /Users/Shared/BSA_10.10.1_rc1/BUILD/obj/RELEASE_X86_64/kernel.dSYM/Contents/Resources/Python/lldbmacros/: Not a directory
make[5]: [/users/Shared/BSA_10.10.1_rc1/BUILD/obj/RELEASE_X86_64/kernel.dSYM/Contents/Resources/Python/lldbmacros/netdefines.py] Error 1 (ignored)
mkdir: /Users/Shared/BSA_10.10.1_rc1/BUILD/obj/RELEASE_X86_64/kernel.dSYM/Contents/Resources/Python/lldbmacros/: Not a directory
make[5]: [/users/Shared/BSA_10.10.1_rc1/BUILD/obj/RELEASE_X86_64/kernel.dSYM/Contents/Resources/Python/lldbmacros/pmap.py] Error 1 (ignored)
installfile: mkstemp(/Users/Shared/BSA_10.10.1_rc1/BUILD/obj/RELEASE_X86_64/kernel.dSYM/Contents/Resources/Python/lldbmacros/ipcimportancedetail.py.UMz6Lh): Not a directory
make[5]: [/users/Shared/BSA_10.10.1_rc1/BUILD/obj/RELEASE_X86_64/kernel.dSYM/Contents/Resources/Python/lldbmacros/ipcimportancedetail.py] Error 69 (ignored)
touch: /Users/Shared/BSA_10.10.1_rc1/BUILD/obj/RELEASE_X86_64/kernel.dSYM/Contents/Resources/Python/lldbmacros/: Not a directory
installfile: mkstemp(/Users/Shared/BSA_10.10.1_rc1/BUILD/obj/RELEASE_X86_64/kernel.dSYM/Contents/Resources/Python/lldbmacros/structanalyze.py.yjZGjR): Not a directory
installfile: mkstemp(/Users/Shared/BSA_10.10.1_rc1/BUILD/obj/RELEASE_X86_64/kernel.dSYM/Contents/Resources/Python/lldbmacros/scheduler.py.2YARxB): Not a directory
make[5]: [/users/Shared/BSA_10.10.1_rc1/BUILD/obj/RELEASE_X86_64/kernel.dSYM/Contents/Resources/Python/lldbmacros/structanalyze.py] Error 69 (ignored)
make[5]: [/users/Shared/BSA_10.10.1_rc1/BUILD/obj/RELEASE_X86_64/kernel.dSYM/Contents/Resources/Python/lldbmacros/scheduler.py] Error 69 (ignored)
make[5]: [/users/Shared/BSA_10.10.1_rc1/BUILD/obj/RELEASE_X86_64/kernel.dSYM/Contents/Resources/Python/lldbmacros/ipcimportancedetail.py] Error 1 (ignored)
installfile: mkstemp(/Users/Shared/BSA_10.10.1_rc1/BUILD/obj/RELEASE_X86_64/kernel.dSYM/Contents/Resources/Python/lldbmacros/ipc.py.PlR7YV): Not a directory
touch: /Users/Shared/BSA_10.10.1_rc1/BUILD/obj/RELEASE_X86_64/kernel.dSYM/Contents/Resources/Python/lldbmacros/: Not a directory
make[5]: [/users/Shared/BSA_10.10.1_rc1/BUILD/obj/RELEASE_X86_64/kernel.dSYM/Contents/Resources/Python/lldbmacros/structanalyze.py] Error 1 (ignored)
make[5]: [/users/Shared/BSA_10.10.1_rc1/BUILD/obj/RELEASE_X86_64/kernel.dSYM/Contents/Resources/Python/lldbmacros/ipc.py] Error 69 (ignored)
touch: /Users/Shared/BSA_10.10.1_rc1/BUILD/obj/RELEASE_X86_64/kernel.dSYM/Contents/Resources/Python/lldbmacros/: Not a directory
make[5]: [/users/Shared/BSA_10.10.1_rc1/BUILD/obj/RELEASE_X86_64/kernel.dSYM/Contents/Resources/Python/lldbmacros/scheduler.py] Error 1 (ignored)
mkdir: /Users/Shared/BSA_10.10.1_rc1/BUILD/obj/RELEASE_X86_64/kernel.dSYM/Contents/Resources/Python/lldbmacros/: Not a directory
make[5]: [/users/Shared/BSA_10.10.1_rc1/BUILD/obj/RELEASE_X86_64/kernel.dSYM/Contents/Resources/Python/lldbmacros/memory.py] Error 1 (ignored)
touch: /Users/Shared/BSA_10.10.1_rc1/BUILD/obj/RELEASE_X86_64/kernel.dSYM/Contents/Resources/Python/lldbmacros/: Not a directory
mkdir: /Users/Shared/BSA_10.10.1_rc1/BUILD/obj/RELEASE_X86_64/kernel.dSYM/Contents/Resources/Python/lldbmacros/: Not a directory
make[5]: [/users/Shared/BSA_10.10.1_rc1/BUILD/obj/RELEASE_X86_64/kernel.dSYM/Contents/Resources/Python/lldbmacros/ipc.py] Error 1 (ignored)
mkdir: /Users/Shared/BSA_10.10.1_rc1/BUILD/obj/RELEASE_X86_64/kernel.dSYM/Contents/Resources/Python/lldbmacros/: Not a directory
make[5]: [/users/Shared/BSA_10.10.1_rc1/BUILD/obj/RELEASE_X86_64/kernel.dSYM/Contents/Resources/Python/lldbmacros/net.py] Error 1 (ignored)mkdir:
/Users/Shared/BSA_10.10.1_rc1/BUILD/obj/RELEASE_X86_64/kernel.dSYM/Contents/Resources/Python/lldbmacros/: Not a directory
make[5]: [/users/Shared/BSA_10.10.1_rc1/BUILD/obj/RELEASE_X86_64/kernel.dSYM/Contents/Resources/Python/lldbmacros/ioreg.py] Error 1 (ignored)
make[5]: [/users/Shared/BSA_10.10.1_rc1/BUILD/obj/RELEASE_X86_64/kernel.dSYM/Contents/Resources/Python/lldbmacros/mbufs.py] Error 1 (ignored)
installfile: mkstemp(/Users/Shared/BSA_10.10.1_rc1/BUILD/obj/RELEASE_X86_64/kernel.dSYM/Contents/Resources/Python/lldbmacros/pmap.py.ZrBI5E): Not a directory
make[5]: [/users/Shared/BSA_10.10.1_rc1/BUILD/obj/RELEASE_X86_64/kernel.dSYM/Contents/Resources/Python/lldbmacros/pmap.py] Error 69 (ignored)
touch: /Users/Shared/BSA_10.10.1_rc1/BUILD/obj/RELEASE_X86_64/kernel.dSYM/Contents/Resources/Python/lldbmacros/: Not a directory
make[5]: [/users/Shared/BSA_10.10.1_rc1/BUILD/obj/RELEASE_X86_64/kernel.dSYM/Contents/Resources/Python/lldbmacros/pmap.py] Error 1 (ignored)
mkdir: /Users/Shared/BSA_10.10.1_rc1/BUILD/obj/RELEASE_X86_64/kernel.dSYM/Contents/Resources/Python/lldbmacros/: Not a directory
make[5]: [/users/Shared/BSA_10.10.1_rc1/BUILD/obj/RELEASE_X86_64/kernel.dSYM/Contents/Resources/Python/lldbmacros/utils.py] Error 1 (ignored)
installfile: mkstemp(/Users/Shared/BSA_10.10.1_rc1/BUILD/obj/RELEASE_X86_64/kernel.dSYM/Contents/Resources/Python/lldbmacros/memory.py.7UYXBc): Not a directory
make[5]: [/users/Shared/BSA_10.10.1_rc1/BUILD/obj/RELEASE_X86_64/kernel.dSYM/Contents/Resources/Python/lldbmacros/memory.py] Error 69 (ignored)
touch: /Users/Shared/BSA_10.10.1_rc1/BUILD/obj/RELEASE_X86_64/kernel.dSYM/Contents/Resources/Python/lldbmacros/: Not a directory
make[5]: [/users/Shared/BSA_10.10.1_rc1/BUILD/obj/RELEASE_X86_64/kernel.dSYM/Contents/Resources/Python/lldbmacros/memory.py] Error 1 (ignored)
mkdir: /Users/Shared/BSA_10.10.1_rc1/BUILD/obj/RELEASE_X86_64/kernel.dSYM/Contents/Resources/Python/lldbmacros/: Not a directory
make[5]: [/users/Shared/BSA_10.10.1_rc1/BUILD/obj/RELEASE_X86_64/kernel.dSYM/Contents/Resources/Python/lldbmacros/kdp.py] Error 1 (ignored)
installfile: mkstemp(/Users/Shared/BSA_10.10.1_rc1/BUILD/obj/RELEASE_X86_64/kernel.dSYM/Contents/Resources/Python/lldbmacros/ioreg.py.o271Ef): Not a directory
make[5]: [/users/Shared/BSA_10.10.1_rc1/BUILD/obj/RELEASE_X86_64/kernel.dSYM/Contents/Resources/Python/lldbmacros/ioreg.py] Error 69 (ignored)
touch: /Users/Shared/BSA_10.10.1_rc1/BUILD/obj/RELEASE_X86_64/kernel.dSYM/Contents/Resources/Python/lldbmacros/: Not a directory
make[5]: [/users/Shared/BSA_10.10.1_rc1/BUILD/obj/RELEASE_X86_64/kernel.dSYM/Contents/Resources/Python/lldbmacros/ioreg.py] Error 1 (ignored)
mkdir: /Users/Shared/BSA_10.10.1_rc1/BUILD/obj/RELEASE_X86_64/kernel.dSYM/Contents/Resources/Python/lldbmacros/: Not a directory
make[5]: [/users/Shared/BSA_10.10.1_rc1/BUILD/obj/RELEASE_X86_64/kernel.dSYM/Contents/Resources/Python/lldbmacros/process.py] Error 1 (ignored)
installfile: mkstemp(/Users/Shared/BSA_10.10.1_rc1/BUILD/obj/RELEASE_X86_64/kernel.dSYM/Contents/Resources/Python/lldbmacros/kdp.py.grxBBI): Not a directory
make[5]: [/users/Shared/BSA_10.10.1_rc1/BUILD/obj/RELEASE_X86_64/kernel.dSYM/Contents/Resources/Python/lldbmacros/kdp.py] Error 69 (ignored)
touch: /Users/Shared/BSA_10.10.1_rc1/BUILD/obj/RELEASE_X86_64/kernel.dSYM/Contents/Resources/Python/lldbmacros/: Not a directory
make[5]: [/users/Shared/BSA_10.10.1_rc1/BUILD/obj/RELEASE_X86_64/kernel.dSYM/Contents/Resources/Python/lldbmacros/kdp.py] Error 1 (ignored)
installfile: mkstemp(/Users/Shared/BSA_10.10.1_rc1/BUILD/obj/RELEASE_X86_64/kernel.dSYM/Contents/Resources/Python/lldbmacros/utils.py.yGQRMm): Not a directory
make[5]: [/users/Shared/BSA_10.10.1_rc1/BUILD/obj/RELEASE_X86_64/kernel.dSYM/Contents/Resources/Python/lldbmacros/utils.py] Error 69 (ignored)
mkdir: /Users/Shared/BSA_10.10.1_rc1/BUILD/obj/RELEASE_X86_64/kernel.dSYM/Contents/Resources/Python/lldbmacros/: Not a directory
make[5]: [/users/Shared/BSA_10.10.1_rc1/BUILD/obj/RELEASE_X86_64/kernel.dSYM/Contents/Resources/Python/lldbmacros/userspace.py] Error 1 (ignored)
touch: /Users/Shared/BSA_10.10.1_rc1/BUILD/obj/RELEASE_X86_64/kernel.dSYM/Contents/Resources/Python/lldbmacros/: Not a directory
make[5]: [/users/Shared/BSA_10.10.1_rc1/BUILD/obj/RELEASE_X86_64/kernel.dSYM/Contents/Resources/Python/lldbmacros/utils.py] Error 1 (ignored)
installfile: mkstemp(/Users/Shared/BSA_10.10.1_rc1/BUILD/obj/RELEASE_X86_64/kernel.dSYM/Contents/Resources/Python/lldbmacros/mbufs.py.XdX5FU): Not a directory
make[5]: [/users/Shared/BSA_10.10.1_rc1/BUILD/obj/RELEASE_X86_64/kernel.dSYM/Contents/Resources/Python/lldbmacros/mbufs.py] Error 69 (ignored)
mkdir: /Users/Shared/BSA_10.10.1_rc1/BUILD/obj/RELEASE_X86_64/kernel.dSYM/Contents/Resources/Python/lldbmacros/: Not a directory
make[5]: [/users/Shared/BSA_10.10.1_rc1/BUILD/obj/RELEASE_X86_64/kernel.dSYM/Contents/Resources/Python/lldbmacros/pci.py] Error 1 (ignored)
touch: /Users/Shared/BSA_10.10.1_rc1/BUILD/obj/RELEASE_X86_64/kernel.dSYM/Contents/Resources/Python/lldbmacros/: Not a directory
make[5]: [/users/Shared/BSA_10.10.1_rc1/BUILD/obj/RELEASE_X86_64/kernel.dSYM/Contents/Resources/Python/lldbmacros/mbufs.py] Error 1 (ignored)
installfile: mkstemp(/Users/Shared/BSA_10.10.1_rc1/BUILD/obj/RELEASE_X86_64/kernel.dSYM/Contents/Resources/Python/lldbmacros/net.py.6a2P7p): Not a directory
make[5]: [/users/Shared/BSA_10.10.1_rc1/BUILD/obj/RELEASE_X86_64/kernel.dSYM/Contents/Resources/Python/lldbmacros/net.py] Error 69 (ignored)
mkdir: /Users/Shared/BSA_10.10.1_rc1/BUILD/obj/RELEASE_X86_64/kernel.dSYM/Contents/Resources/Python/lldbmacros/: Not a directory
touch: /Users/Shared/BSA_10.10.1_rc1/BUILD/obj/RELEASE_X86_64/kernel.dSYM/Contents/Resources/Python/lldbmacros/: Not a directory
make[5]: [/users/Shared/BSA_10.10.1_rc1/BUILD/obj/RELEASE_X86_64/kernel.dSYM/Contents/Resources/Python/lldbmacros/net.py] Error 1 (ignored)
make[5]: [/users/Shared/BSA_10.10.1_rc1/BUILD/obj/RELEASE_X86_64/kernel.dSYM/Contents/Resources/Python/lldbmacros/misc.py] Error 1 (ignored)
installfile: mkstemp(/Users/Shared/BSA_10.10.1_rc1/BUILD/obj/RELEASE_X86_64/kernel.dSYM/Contents/Resources/Python/lldbmacros/process.py.MeqtlU): Not a directory
make[5]: [/users/Shared/BSA_10.10.1_rc1/BUILD/obj/RELEASE_X86_64/kernel.dSYM/Contents/Resources/Python/lldbmacros/process.py] Error 69 (ignored)
mkdir: /Users/Shared/BSA_10.10.1_rc1/BUILD/obj/RELEASE_X86_64/kernel.dSYM/Contents/Resources/Python/lldbmacros/: Not a directory
make[5]: [/users/Shared/BSA_10.10.1_rc1/BUILD/obj/RELEASE_X86_64/kernel.dSYM/Contents/Resources/Python/lldbmacros/apic.py] Error 1 (ignored)
touch: /Users/Shared/BSA_10.10.1_rc1/BUILD/obj/RELEASE_X86_64/kernel.dSYM/Contents/Resources/Python/lldbmacros/: Not a directory
make[5]: [/users/Shared/BSA_10.10.1_rc1/BUILD/obj/RELEASE_X86_64/kernel.dSYM/Contents/Resources/Python/lldbmacros/process.py] Error 1 (ignored)
mkdir: /Users/Shared/BSA_10.10.1_rc1/BUILD/obj/RELEASE_X86_64/kernel.dSYM/Contents/Resources/Python/: Not a directory
make[5]: [/users/Shared/BSA_10.10.1_rc1/BUILD/obj/RELEASE_X86_64/kernel.dSYM/Contents/Resources/Python/kernel.py] Error 1 (ignored)
installfile: mkstemp(/Users/Shared/BSA_10.10.1_rc1/BUILD/obj/RELEASE_X86_64/kernel.dSYM/Contents/Resources/Python/lldbmacros/userspace.py.bFT6Db): Not a directory
make[5]: [/users/Shared/BSA_10.10.1_rc1/BUILD/obj/RELEASE_X86_64/kernel.dSYM/Contents/Resources/Python/lldbmacros/userspace.py] Error 69 (ignored)
touch: /Users/Shared/BSA_10.10.1_rc1/BUILD/obj/RELEASE_X86_64/kernel.dSYM/Contents/Resources/Python/lldbmacros/: Not a directory
make[5]: [/users/Shared/BSA_10.10.1_rc1/BUILD/obj/RELEASE_X86_64/kernel.dSYM/Contents/Resources/Python/lldbmacros/userspace.py] Error 1 (ignored)
installfile: mkstemp(/Users/Shared/BSA_10.10.1_rc1/BUILD/obj/RELEASE_X86_64/kernel.dSYM/Contents/Resources/Python/lldbmacros/pci.py.53TWDM): Not a directory
make[5]: [/users/Shared/BSA_10.10.1_rc1/BUILD/obj/RELEASE_X86_64/kernel.dSYM/Contents/Resources/Python/lldbmacros/pci.py] Error 69 (ignored)
touch: /Users/Shared/BSA_10.10.1_rc1/BUILD/obj/RELEASE_X86_64/kernel.dSYM/Contents/Resources/Python/lldbmacros/: Not a directory
make[5]: [/users/Shared/BSA_10.10.1_rc1/BUILD/obj/RELEASE_X86_64/kernel.dSYM/Contents/Resources/Python/lldbmacros/pci.py] Error 1 (ignored)
installfile: mkstemp(/Users/Shared/BSA_10.10.1_rc1/BUILD/obj/RELEASE_X86_64/kernel.dSYM/Contents/Resources/Python/kernel.py.vG1WYo): Not a directory
make[5]: [/users/Shared/BSA_10.10.1_rc1/BUILD/obj/RELEASE_X86_64/kernel.dSYM/Contents/Resources/Python/kernel.py] Error 69 (ignored)
installfile: mkstemp(/Users/Shared/BSA_10.10.1_rc1/BUILD/obj/RELEASE_X86_64/kernel.dSYM/Contents/Resources/Python/lldbmacros/misc.py.uda2EE): Not a directory
make[5]: [/users/Shared/BSA_10.10.1_rc1/BUILD/obj/RELEASE_X86_64/kernel.dSYM/Contents/Resources/Python/lldbmacros/misc.py] Error 69 (ignored)
touch: /Users/Shared/BSA_10.10.1_rc1/BUILD/obj/RELEASE_X86_64/kernel.dSYM/Contents/Resources/Python/lldbmacros/: Not a directory
make[5]: [/users/Shared/BSA_10.10.1_rc1/BUILD/obj/RELEASE_X86_64/kernel.dSYM/Contents/Resources/Python/lldbmacros/misc.py] Error 1 (ignored)
installfile: mkstemp(/Users/Shared/BSA_10.10.1_rc1/BUILD/obj/RELEASE_X86_64/kernel.dSYM/Contents/Resources/Python/lldbmacros/apic.py.lQD37J): Not a directory
make[5]: [/users/Shared/BSA_10.10.1_rc1/BUILD/obj/RELEASE_X86_64/kernel.dSYM/Contents/Resources/Python/lldbmacros/apic.py] Error 69 (ignored)
touch: /Users/Shared/BSA_10.10.1_rc1/BUILD/obj/RELEASE_X86_64/kernel.dSYM/Contents/Resources/Python/lldbmacros/: Not a directory
make[5]: [/users/Shared/BSA_10.10.1_rc1/BUILD/obj/RELEASE_X86_64/kernel.dSYM/Contents/Resources/Python/lldbmacros/apic.py] Error 1 (ignored)

INSTALLSYM symbolset Libkern (x86_64)
INSTALLSYM symbolset IOKit (x86_64)
INSTALLSYM symbolset BSDKernel (x86_64)
installfile: open(/Users/Shared/BSA_10.10.1_rc1/BUILD/obj/RELEASE_X86_64/Libkern.symbolset): No such file or directory
installfile: open(/Users/Shared/BSA_10.10.1_rc1/BUILD/obj/RELEASE_X86_64/IOKit.symbolset): No such file or directory
make[4]: [/users/Shared/BSA_10.10.1_rc1/BUILD/sym/System.kext/PlugIns/Libkern.kext/Libkern] Error 66 (ignored)
make[4]: [/users/Shared/BSA_10.10.1_rc1/BUILD/sym/System.kext/PlugIns/IOKit.kext/IOKit] Error 66 (ignored)
installfile: open(/Users/Shared/BSA_10.10.1_rc1/BUILD/obj/RELEASE_X86_64/BSDKernel.symbolset): No such file or directory
make[4]: [/users/Shared/BSA_10.10.1_rc1/BUILD/sym/System.kext/PlugIns/BSDKernel.kext/BSDKernel] Error 66 (ignored)

INSTALLSYM symbolset Mach (x86_64)
INSTALLSYM symbolset MACFramework (x86_64)
installfile: open(/Users/Shared/BSA_10.10.1_rc1/BUILD/obj/RELEASE_X86_64/Mach.symbolset): No such file or directory
make[4]: [/users/Shared/BSA_10.10.1_rc1/BUILD/sym/System.kext/PlugIns/Mach.kext/Mach] Error 66 (ignored)
installfile: open(/Users/Shared/BSA_10.10.1_rc1/BUILD/obj/RELEASE_X86_64/MACFramework.symbolset): No such file or directory
make[4]: [/users/Shared/BSA_10.10.1_rc1/BUILD/sym/System.kext/PlugIns/MACFramework.kext/MACFramework] Error 66 (ignored)

INSTALLSYM symbolset Unsupported (x86_64)
installfile: open(/Users/Shared/BSA_10.10.1_rc1/BUILD/obj/RELEASE_X86_64/Unsupported.symbolset): No such file or directory
INSTALLSYM symbolset Private (x86_64)
make[4]: [/users/Shared/BSA_10.10.1_rc1/BUILD/sym/System.kext/PlugIns/Unsupported.kext/Unsupported] Error 66 (ignored)
INSTALLSYM kextplist System.kext/Info.plist
INSTALLSYM kextplist System.kext/PlugIns/AppleNMI.kext/Info.plist
installfile: open(/Users/Shared/BSA_10.10.1_rc1/BUILD/obj/RELEASE_X86_64/Private.symbolset): No such file or directory
make[4]: [/users/Shared/BSA_10.10.1_rc1/BUILD/sym/System.kext/PlugIns/Private.kext/Private] Error 66 (ignored)

INSTALLSYM kextplist System.kext/PlugIns/ApplePlatformFamily.kext/Info.plist
INSTALLSYM kextplist System.kext/PlugIns/IONVRAMFamily.kext/Info.plist
make[3]: *** No rule to make target `/Users/Shared/BSA_10.10.1_rc1/BUILD/obj/RELEASE_X86_64//kernel.dSYM/Contents/Info.plist', needed by `/Users/Shared/BSA_10.10.1_rc1/BUILD/sym/kernel.dSYM/Contents/Info.plist'.
make[3]: *** No rule to make target `/Users/Shared/BSA_10.10.1_rc1/BUILD/obj/RELEASE_X86_64//kernel.dSYM/Contents/Resources/Python/lldbmacros', needed by `/Users/Shared/BSA_10.10.1_rc1/BUILD/sym/kernel.dSYM/Contents/Resources/Python/lldbmacros'.
make[3]: *** No rule to make target `/Users/Shared/BSA_10.10.1_rc1/BUILD/obj/RELEASE_X86_64//kernel.dSYM/Contents/Resources/Python/kernel.py', needed by `/Users/Shared/BSA_10.10.1_rc1/BUILD/sym/kernel.dSYM/Contents/Resources/Python/kernel.py'.
make[3]: *** No rule to make target `/Users/Shared/BSA_10.10.1_rc1/BUILD/obj/RELEASE_X86_64//kernel.dSYM/Contents/Resources/DWARF/kernel', needed by `/Users/Shared/BSA_10.10.1_rc1/BUILD/sym/kernel.dSYM/Contents/Resources/DWARF/kernel'.

CC version.o
INSTALLSYM kextplist System.kext/PlugIns/IOSystemManagement.kext/Info.plist
INSTALLSYM kextplist System.kext/PlugIns/BSDKernel.kext/Info.plist
INSTALLSYM kextplist System.kext/PlugIns/IOKit.kext/Info.plist
INSTALLSYM kextplist System.kext/PlugIns/Libkern.kext/Info.plist
INSTALLSYM kextplist System.kext/PlugIns/Mach.kext/Info.plist
LD kernel.unstripped
INSTALLSYM kextplist System.kext/PlugIns/MACFramework.kext/Info.plist
INSTALLSYM kextplist System.kext/PlugIns/Unsupported.kext/Info.plist
INSTALLSYM kextplist System.kext/PlugIns/Private.kext/Info.plist
INSTALL BSDKernel (x86_64)
installfile: open(/Users/Shared/BSA_10.10.1_rc1/BUILD/sym/System.kext/PlugIns/BSDKernel.kext/BSDKernel): No such file or directory
make[4]: [/users/Shared/BSA_10.10.1_rc1/BUILD/dst/System/Library/Extensions/System.kext/PlugIns/BSDKernel.kext/BSDKernel] Error 66 (ignored)

INSTALL IOKit (x86_64)
installfile: open(/Users/Shared/BSA_10.10.1_rc1/BUILD/sym/System.kext/PlugIns/IOKit.kext/IOKit): No such file or directory
make[4]: [/users/Shared/BSA_10.10.1_rc1/BUILD/dst/System/Library/Extensions/System.kext/PlugIns/IOKit.kext/IOKit] Error 66 (ignored)

INSTALL Libkern (x86_64)
INSTALL Mach (x86_64)
INSTALL MACFramework (x86_64)
INSTALL Unsupported (x86_64)
installfile: open(/Users/Shared/BSA_10.10.1_rc1/BUILD/sym/System.kext/PlugIns/Libkern.kext/Libkern): No such file or directory
make[4]: [/users/Shared/BSA_10.10.1_rc1/BUILD/dst/System/Library/Extensions/System.kext/PlugIns/Libkern.kext/Libkern] Error 66 (ignored)
installfile: open(/Users/Shared/BSA_10.10.1_rc1/BUILD/sym/System.kext/PlugIns/Mach.kext/Mach): No such file or directory
installfile: open(/Users/Shared/BSA_10.10.1_rc1/BUILD/sym/System.kext/PlugIns/MACFramework.kext/MACFramework): No such file or directory
make[4]: [/users/Shared/BSA_10.10.1_rc1/BUILD/dst/System/Library/Extensions/System.kext/PlugIns/Mach.kext/Mach] Error 66 (ignored)
make[4]: [/users/Shared/BSA_10.10.1_rc1/BUILD/dst/System/Library/Extensions/System.kext/PlugIns/MACFramework.kext/MACFramework] Error 66 (ignored)
installfile: open(/Users/Shared/BSA_10.10.1_rc1/BUILD/sym/System.kext/PlugIns/Unsupported.kext/Unsupported): No such file or directory
make[4]: [/users/Shared/BSA_10.10.1_rc1/BUILD/dst/System/Library/Extensions/System.kext/PlugIns/Unsupported.kext/Unsupported] Error 66 (ignored)

INSTALL kextplist System.kext/Info.plist
INSTALL Private (x86_64)
INSTALL kextplist System.kext/PlugIns/ApplePlatformFamily.kext/Info.plist
INSTALL kextplist System.kext/PlugIns/AppleNMI.kext/Info.plist
installfile: open(/Users/Shared/BSA_10.10.1_rc1/BUILD/sym/System.kext/PlugIns/Private.kext/Private): No such file or directory
make[4]: [/users/Shared/BSA_10.10.1_rc1/BUILD/dst/System/Library/Extensions/System.kext/PlugIns/Private.kext/Private] Error 66 (ignored)

INSTALL kextplist System.kext/PlugIns/IONVRAMFamily.kext/Info.plist
INSTALL kextplist System.kext/PlugIns/IOSystemManagement.kext/Info.plist
INSTALL kextplist System.kext/PlugIns/BSDKernel.kext/Info.plist
INSTALL kextplist System.kext/PlugIns/IOKit.kext/Info.plist
INSTALL kextplist System.kext/PlugIns/Libkern.kext/Info.plist
INSTALL kextplist System.kext/PlugIns/Mach.kext/Info.plist
INSTALL kextplist System.kext/PlugIns/MACFramework.kext/Info.plist
INSTALL kextplist System.kext/PlugIns/Unsupported.kext/Info.plist
INSTALL kextplist System.kext/PlugIns/Private.kext/Info.plist
INSTALL SupportedKPIs-x86_64.txt
INSTALL SupportedKPIs-all-archs.txt
undef: _opemu_utrap
undef: _opemu_ktrap
undef: _BF_set_key
undef: _BF_encrypt
undef: _BF_decrypt
Undefined symbols for architecture x86_64:
"_opemu_utrap", referenced from:
_user_trap in trap.o
"_opemu_ktrap", referenced from:
_kernel_trap in trap.o
"_BF_set_key", referenced from:
_ink_decrypt in page_decrypt.o
"_BF_encrypt", referenced from:
_BF_cbc_encrypt in page_decrypt.o
"_BF_decrypt", referenced from:
_BF_cbc_encrypt in page_decrypt.o
ld: symbol(s) not found for architecture x86_64

clang: error: linker command failed with exit code 1 (use -v to see invocation)
make[3]: [/users/Shared/BSA_10.10.1_rc1/BUILD/obj/RELEASE_X86_64//kernel.unstripped] Error 1 (ignored)

STRIP kernel
error: /Applications/Xcode.app/Contents/Developer/Toolchains/XcodeDefault.xctoolchain/usr/bin/strip: can't open file: /Users/Shared/BSA_10.10.1_rc1/BUILD/obj/RELEASE_X86_64//kernel.unstripped (No such file or directory)
make[3]: [/users/Shared/BSA_10.10.1_rc1/BUILD/obj/RELEASE_X86_64//kernel] Error 1 (ignored)

CTFMERGE kernel
INSTALLSYM kernel (x86_64)
installfile: open(/Users/Shared/BSA_10.10.1_rc1/BUILD/obj/RELEASE_X86_64//kernel.unstripped): No such file or directory
make[3]: [/users/Shared/BSA_10.10.1_rc1/BUILD/sym/kernel] Error 66 (ignored)
ERROR: ctfmerge: Cannot open output file /Users/Shared/BSA_10.10.1_rc1/BUILD/obj/RELEASE_X86_64//kernel for r/w: No such file or directory

INSTALL kernel (x86_64 none)
installfile: open(/Users/Shared/BSA_10.10.1_rc1/BUILD/obj/RELEASE_X86_64//kernel): No such file or directory
make[3]: [/users/Shared/BSA_10.10.1_rc1/BUILD/dst//System/Library/Kernels/kernel] Error 66 (ignored)
make[3]: Target `do_build_install_primary' not remade because of errors.
make[2]: [build_install_primary] Error 2 (ignored)

 

Edited by spakk

Unfortunately, the same result:

 

error.txt:

 

 

ERROR: ctfconvert: file does not contain dwarf type data (try compiling with -g)
ERROR: ctfconvert: file does not contain dwarf type data (try compiling with -g)
ERROR: ctfconvert: file does not contain dwarf type data (try compiling with -g)
ERROR: ctfconvert: file does not contain dwarf type data (try compiling with -g)
ERROR: ctfconvert: file does not contain dwarf type data (try compiling with -g)
ERROR: ctfconvert: file does not contain dwarf type data (try compiling with -g)
ERROR: mptcp_usrreq.c: die 25750: no attr 0x49
ERROR: ctfconvert: file does not contain dwarf type data (try compiling with -g)
clang: error: unable to execute command: Segmentation fault: 11
clang: error: linker command failed due to signal (use -v to see invocation)
make[3]: *** [/users/mein/Kernel/xnu-2782.1.97/BUILD/obj/RELEASE_X86_64//kernel.unstripped] Error 254
make[2]: *** [build_all] Error 2
make[1]: *** [build_all_bootstrap_RELEASE^X86_64^NONE] Error 2
make: *** [all] Error 2

 

 

success.txt:

 

HOST_CC decomment.o
HOST_CC externs.o
HOST_CC setsegname.o
HOST_CC kextsymboltool.o
HOST_CC installfile.o
HOST_BISON parser.c
HOST_LD installfile
HOST_LD decomment
HOST_CC openp.o
HOST_LD setsegname
HOST_CC searchp.o
HOST_FLEX lexer.yy.c
HOST_LD kextsymboltool
HOST_CODESIGN decomment
HOST_CODESIGN setsegname
HOST_CODESIGN installfile
HOST_CODESIGN kextsymboltool
HOST_CC parser.o
HOST_CC main.o
HOST_CC mkheaders.o
HOST_CC mkioconf.o
HOST_CC mkmakefile.o
HOST_CC replacecontents.o
HOST_CC lexer.yy.o
HOST_LD replacecontents
HOST_CODESIGN replacecontents
HOST_LD config
HOST_CODESIGN config
MIG clock.h
MIG clock_priv.h
MIG host_priv.h
MIG host_security.h
MIG default_pager_object.h
MIG lock_set.h
MIG mach_host.h
Generating libkern/version.h from /Users/mein/Kernel/xnu-2782.1.97/libkern/libkern/version.h.template
MIG mach_port.h
MIG mach_vm.h
MIG mach_voucher.h
MIG mach_voucher_attr_control.h
MIG memory_object_control.h
MIG processor.h
MIG processor_set.h
MIG task.h
MIG gssd_mach.h
MIG task_access.h
MIG kextd_mach.h
MIG thread_act.h
MIG upl.h
MIG lockd_mach.h
MIG vm_map.h
Generating bsd/sys/sysproto.h from /Users/mein/Kernel/xnu-2782.1.97/bsd/kern/syscalls.master
MIG audit_triggers_server.h
MIG clock_reply_server.h
MIG coalition_notification_server.h
MIG exc_server.h
MIG mach_exc_server.h
MIG memory_object_server.h
MIG memory_object_default_server.h
MIG notify_server.h
MIG task_access_server.h
MIG telemetry_notification_server.h
Generating bsd/sys/syscall.h from /Users/mein/Kernel/xnu-2782.1.97/bsd/kern/syscalls.master
CC device_tree.o
C++ IOLib.cpo
CC OSRuntimeSupport.o
C++ OSSerialize.cpo
C++ OSSet.cpo
CC bootargs.o
MIG atm_notification_user.c
C++ OSString.cpo
C++ IOLocks.cpo
CC pe_gen.o
MIG default_pager_alerts_user.c
C++ OSSymbol.cpo
C++ IOConditionLock.cpo
CC pe_init.o
MIG default_pager_object_server.c
Generating audit_kevents.c from /Users/mein/Kernel/xnu-2782.1.97/bsd/kern/syscalls.master
C++ IOStartIOKit.cpo
C++ OSUnserialize.cpo
CC pe_bootargs.o
C++ OSUnserializeXML.cpo
MIG device_server.h
CC audit_mac.o
CC pe_identify_machine.o
CC pe_kprintf.o
C++ IODeviceTreeSupport.cpo
MIG device_server.c
CC audit_pipe.o
CC pe_interrupt.o
C++ OSSerializeBinary.cpo
CC pe_serial.o
LDFILELIST pexpert
C++ IORegistryEntry.cpo
C++ OSKextLib.cpo
MIG audit_triggers_user.c
CC audit_session.o
C++ IOService.cpo
CC mkext.o
MIG clock_reply_user.c
CC OSKextVersion.o
C++ bootstrap.cpo
MIG coalition_notification_user.c
CC inet_aton.o
CC audit_syscalls.o
CC inet_ntoa.o
MIG exc_user.c
LDFILELIST libsa
CC inet_ntop.o
C++ IOServicePM.cpo
CC inet_pton.o
MIG host_notify_reply_user.c
CC scanf.o
MIG mach_exc_user.c
CC audit_worker.o
CC uuid.o
MIG mach_notify_user.c
CC mac_alloc.o
CC kernel_mach_header.o
CC mac_audit.o
MIG memory_object_user.c
CC adler32.o
CC compress.o
CC crc32.o
MIG memory_object_control_user.c
CC bsd_init.o
CC mac_base.o
CC deflate.o
MIG memory_object_default_user.c
MIG task_access_user.c
C++ IOPMinformee.cpo
CC infback.o
C++ IOPMinformeeList.cpo
Generating init_sysent.c from /Users/mein/Kernel/xnu-2782.1.97/bsd/kern/syscalls.master
MIG telemetry_notification_user.c
C++ IOPMPowerStateQueue.cpo
CC inffast.o
CC kdebug.o
MIG upl_user.c
CC inflate.o
CC mac_data.o
C++ IOCatalogue.cpo
MIG vm_map_user.c
CC mac_label.o
C++ IOPMPowerSource.cpo
MIG clock_server.c
CC mac_process.o
MIG clock_priv_server.c
C++ IOPMPowerSourceList.cpo
CC inftrees.o
C++ IOPolledInterface.cpo
MIG exc_server.c
CC trees.o
C++ IOWorkLoop.cpo
CC kern_acct.o
MIG host_priv_server.c
CC uncompr.o
C++ IOEventSource.cpo
CC zutil.o
CC mac_vfs.o
CC register_crypto.o
MIG host_security_server.c
CC corecrypto_sha2.o
CC kern_aio.o
C++ IOInterruptEventSource.cpo
CC corecrypto_sha1.o
MIG lock_set_server.c
C++ IOCommandGate.cpo
CC corecrypto_md5.o
CC corecrypto_des.o
MIG mach_exc_server.c
C++ IOCommand.cpo
CC corecrypto_aes.o
C++ IOCommandPool.cpo
CC corecrypto_aesxts.o
CC stack_protector.o
MIG mach_host_server.c
CC kxld.o
C++ IOCommandQueue.cpo
C++ IODMAEventSource.cpo
CC kern_authorization.o
CC kxld_array.o
MIG mach_notify_server.c
C++ IOFilterInterruptEventSource.cpo
CC kxld_copyright.o
CC kxld_demangle.o
MIG mach_port_server.c
CC kxld_dict.o
C++ IOTimerEventSource.cpo
CC kern_clock.o
CC kxld_kext.o
MIG mach_vm_server.c
C++ IOBufferMemoryDescriptor.cpo
CC kern_core.o
CC kxld_reloc.o
MIG mach_voucher_server.c
C++ IODMACommand.cpo
CC kern_credential.o
CC kxld_object.o
MIG mach_voucher_attr_control_server.c
CC mac_vfs_subr.o
C++ IODeviceMemory.cpo
MIG memory_object_server.c
CC kxld_sect.o
C++ IOInterleavedMemoryDescriptor.cpo
CC kxld_seg.o
CC mac_system.o
C++ IOMapper.cpo
MIG memory_object_control_server.c
CC kxld_srcversion.o
CC kxld_sym.o
MIG memory_object_default_server.c
C++ IOMemoryCursor.cpo
CC kxld_symtab.o
CC mac_sysv_sem.o
C++ IOMemoryDescriptor.cpo
MIG processor_server.c
CC kxld_util.o
CC mac_sysv_shm.o
MIG processor_set_server.c
CC kxld_uuid.o
CC kxld_versionmin.o
CC kern_cs.o
CC kxld_vtable.o
MIG task_server.c
CC mac_sysv_msg.o
CC kxld_stubs.o
CC OSAtomicOperations.o
CC kern_csr.o
MIG thread_act_server.c
C++ OSDebug.cpo
C++ IOMultiMemoryDescriptor.cpo
C++ OSMetaClass.cpo
CC mac_posix_sem.o
CC kern_symfile.o
MIG upl_server.c
C++ IORangeAllocator.cpo
C++ IOSubMemoryDescriptor.cpo
CC mac_posix_shm.o
MIG vm_map_server.c
C++ OSObject.cpo
CC kern_descrip.o
C++ IOPlatformExpert.cpo
C++ OSArray.cpo
MIG vm32_map_server.c
C++ OSBoolean.cpo
CC mac_socket.o
C++ OSCollection.cpo
MIG UNDRequest.c
C++ OSCollectionIterator.cpo
C++ OSData.cpo
C++ IOCPU.cpo
MIG UNDReplyServer.c
CC mac_pipe.o
C++ OSDictionary.cpo
C++ OSIterator.cpo
MIG gssd_mach.c
C++ OSKext.cpo
C++ IONVRAM.cpo
CC mac_iokit.o
MIG gssd_mach.h
CC mac_file.o
C++ IODMAController.cpo
MIG kextd_mach.c
C++ IOInterruptController.cpo
MIG kextd_mach.h
CC kern_guarded.o
CC mac_priv.o
C++ IOUserClient.cpo
MIG lockd_mach.c
CC mac_pty.o
C++ OSNumber.cpo
CC kern_event.o
MIG lockd_mach.h
C++ OSOrderedSet.cpo
CC mac_kext.o
C++ OSRuntime.cpo
GENASSYM /Users/mein/Kernel/xnu-2782.1.97/osfmk/i386/genassym.c
LDFILELIST security
CC kern_control.o
AS OSAtomic.o
LDFILELIST libkern
C++ IOKitDebug.cpo
CC kern_exec.o
CC bsd_i386.o
C++ IODataQueue.cpo
C++ IOSharedDataQueue.cpo
CC bsd_i386_native.o
C++ IOStatistics.cpo
CC machdep_call.o
CC boot_pt.o
C++ IOInterruptAccounting.cpo
CC kern_exit.o
CC mp_desc.o
C++ IOReporter.cpo
CC kern_lockf.o
CC gdt.o
C++ IOSimpleReporter.cpo
CC cpu.o
C++ IOStateReporter.cpo
CC kern_fork.o
CC cpuid.o
CC kern_asl.o
C++ IOHistogramReporter.cpo
CC cpu_threads.o
C++ IOReportLegend.cpo
CC cpu_topology.o
CC IOStringFuncs.o
CC kern_malloc.o
C++ KernelConfigTables.cpo
CC i386_timer.o
C++ IOKitBSDInit.cpo
CC kern_mman.o
C++ DINetBootHook.cpo
CC fpu.o
CC i386_init.o
CC kern_physio.o
C++ RootDomainUserClient.cpo
C++ IOPowerConnection.cpo
CC kern_priv.o
CC i386_vm_init.o
CC io_map.o
C++ IOWatchDogTimer.cpo
CC kern_proc.o
CC kern_prot.o
C++ IOSyncer.cpo
CC ktss.o
C++ IOPMrootDomain.cpo
CC kern_resource.o
CC ldt.o
CC loose_ends.o
C++ IntelClock.cpo
CC copyio.o
CC kern_shutdown.o
CC locks_i386.o
CC kern_sig.o
CC lowmem_vectors.o
CC kern_subr.o
CC machine_routines.o
C++ IOKeyStoreHelper.cpo
CC machine_check.o
CC kern_synch.o
C++ IOHibernateIO.cpo
CC machine_task.o
CC IOHibernateRestoreKernel.o
CC pcb.o
CC kern_sysctl.o
AS IOSharedLock.o
CC kern_newsysctl.o
CC pcb_native.o
AS IOAsmSupport.o
CC phys.o
LDFILELIST iokit
CC kern_memorystatus.o
CC kern_mib.o
CC rtclock.o
CC rtclock_native.o
CC trap.o
CC trap_native.o
CC kpi_mbuf.o
CC kern_sfi.o
CC kern_time.o
CC user_ldt.o
CC Diagnostics.o
CC pmCPU.o
CC kern_xxx.o
CC mach_process.o
CC tsc.o
CC mcache.o
CC spl.o
CC commpage.o
CC conf.o
CC subr_log.o
CC subr_prf.o
CC model_dep.o
CC subr_prof.o
CC lapic.o
CC lapic_native.o
CC subr_sbuf.o
CC mp.o
CC mp_native.o
CC subr_xxx.o
CC sys_generic.o
CC sys_pipe.o
CC acpi.o
CC mtrr.o
CC sys_socket.o
CC sys_domain.o
CC serial_console.o
CC sys_coalition.o
CC video_console.o
Generating syscalls.c from /Users/mein/Kernel/xnu-2782.1.97/bsd/kern/syscalls.master
CC video_scroll.o
CC tty.o
CC kdp_machdep.o
CC kdp_vm.o
CC tty_compat.o
CC tty_conf.o
CC kdp_x86_common.o
CC hibernate_i386.o
CC tty_dev.o
CC hibernate_restore.o
CC tty_ptmx.o
CC tty_pty.o
CC tty_subr.o
CC chud_osfmk_callback_i386.o
CC tty_tty.o
CC chud_cpu_i386.o
CC chud_thread_i386.o
CC ubc_subr.o
CC uipc_domain.o
CC uipc_mbuf.o
CC uipc_mbuf2.o
CC ucode.o
CC vmx_cpu.o
CC uipc_proto.o
CC vmx_shims.o
CC uipc_socket.o
CC hv_support.o
CC kperf_mp.o
CC uipc_socket2.o
CC uipc_syscalls.o
CC kpc_x86.o
CC startup64.o
CC panic_hooks.o
CC opemu_math.o
CC opemu.o
CC ssse3.o
CC uipc_usrreq.o
CC sse3.o
CC sysv_ipc.o
CC sse42.o
CC decode.o
CC itab.o
CC sysv_shm.o
CC syn.o
CC sysv_sem.o
CC sysv_msg.o
CC syn-intel.o
CC udis86.o
CC vm_compressor_backing_store.o
CC default_pager.o
CC dp_backing_store.o
CC dp_memory_object.o
CC mach_fat.o
CC mach_loader.o
CC posix_sem.o
CC posix_shm.o
CC qsort.o
CC default_pager_alerts_user.o
CC kpi_socket.o
CC default_pager_object_server.o
CC gssd_mach.o
CC lockd_mach.o
CC kpi_socketfilter.o
CC pthread_shims.o
CC kextd_mach.o
CC UNDRequest.o
CC proc_info.o
CC UNDReplyServer.o
CC process_policy.o
CC KUNCUserNotifications.o
CC kdp.o
CC kern_stackshot.o
CC kdp_udp.o
CC kdp_serial.o
CC kern_overrides.o
CC vm_pressure.o
CC socket_info.o
CC ipc_entry.o
CC ipc_hash.o
CC ipc_importance.o
CC vnode_pager.o
CC vm_unix.o
CC ipc_init.o
CC dp_backing_file.o
CC ipc_kmsg.o
CC vm_compressor_backing_file.o
CC ipc_mqueue.o
CC ux_exception.o
CC ipc_notify.o
CC param.o
CC ipc_object.o
CC ioconf.o
CC ipc_port.o
CC chud_bsd_callback.o
CC ipc_pset.o
CC chud_process.o
CC ipc_right.o
CC imageboot.o
CC ipc_space.o
CC ipc_table.o
CC kperfbsd.o
CC kern_kpc.o
CC proc_uuid_policy.o
CC conf.o
CC ipc_voucher.o
CC mach_debug.o
CC mach_kernelrpc.o
CC cons.o
CC mach_msg.o
CC km.o
CC mach_port.o
CC kern_machdep.o
CC affinity.o
CC stubs.o
CC systemcalls.o
CC ast.o
CC sysctl.o
CC audit_sessionport.o
CC unix_signal.o
CC dtrace_isa.o
CC btlog.o
CC clock.o
CC dtrace_subr_x86.o
CC fbt_x86.o
CC clock_oldops.o
CC coalition.o
CC counters.o
CC sdt_x86.o
CC fasttrap_isa.o
CC debug.o
CC instr_size.o
CC energy_perf.o
CC exception.o
CC dis_tables.o
CC extmod_statistics.o
CC policy_check.o
CC bsd_stubs.o
CC host.o
CC host_notify.o
CC ipc_clock.o
CC ipc_host.o
CC cpu_in_cksum.o
CC in_cksum.o
CC ipc_kobject.o
CC ipc_mig.o
CC nfs4_subs.o
CC ipc_misc.o
CC nfs4_vnops.o
CC krpc_subr.o
CC ipc_sync.o
CC ipc_tt.o
CC nfs_bio.o
CC kalloc.o
CC nfs_boot.o
CC ledger.o
CC locks.o
CC nfs_gss.o
CC machine.o
CC mk_sp.o
CC nfs_gss_crypto.o
CC mk_timer.o
CC nfs_lock.o
CC page_decrypt.o
CC printf.o
CC priority.o
CC nfs_node.o
CC processor.o
CC processor_data.o
CC sched_average.o
CC nfs_serv.o
CC sched_dualq.o
CC sched_prim.o
CC sched_multiq.o
CC nfs_socket.o
CC nfs_srvcache.o
CC sfi.o
CC nfs_subs.o
CC stack.o
CC startup.o
CC sync_lock.o
CC sync_sema.o
CC syscall_emulation.o
CC syscall_subr.o
CC nfs_syscalls.o
CC syscall_sw.o
CC nfs_vfsops.o
CC task.o
CC task_policy.o
CC task_swap.o
CC nfs_vnops.o
CC nfs_upcall.o
CC thread.o
CC netboot.o
CC thread_act.o
CC thread_call.o
CC dtrace.o
CC thread_policy.o
CC timer.o
CC timer_call.o
CC wait_queue.o
CC zalloc.o
CC gzalloc.o
CC bsd_kern.o
CC lockstat.o
CC dtrace_ptss.o
CC hibernate.o
CC dtrace_subr.o
CC pmc.o
CC clock_server.o
CC dtrace_glue.o
CC dtrace_alloc.o
CC clock_priv_server.o
CC clock_reply_user.o
CC blist.o
CC fbt.o
CC exc_user.o
CC exc_server.o
CC host_priv_server.o
CC host_security_server.o
CC sdt.o
CC lock_set_server.o
CC mach_exc_user.o
CC sdt_subr.o
CC mach_exc_server.o
CC systrace.o
CC profile_prvd.o
CC mach_host_server.o
CC fasttrap.o
CC mach_notify_user.o
CC mach_port_server.o
CC randomdev.o
CC mach_vm_server.o
CC memdev.o
CC mem.o
CC mach_voucher_server.o
CC munge.o
CC unix_startup.o
CC mach_voucher_attr_control_server.o
CC memory_object_server.o
CC crc32.o
CC memory_object_control_server.o
CC random.o
CC memory_object_default_server.o
CC upl_server.o
CC scanc.o
CC audit_triggers_user.o
CC skpc.o
CC strsep.o
CC bcd.o
CC task_access_user.o
CC telemetry_notification_user.o
CC memchr.o
CC vfs_attrlist.o
CC vfs_bio.o
CC bank.o
CC atm.o
CC vfs_cache.o
CC atm_notification_user.o
CC coalition_notification_user.o
CC processor_server.o
CC processor_set_server.o
CC vfs_cluster.o
CC task_server.o
CC vfs_conf.o
CC thread_act_server.o
CC vfs_fslog.o
CC vm32_map_server.o
CC bsd_vm.o
CC vm_compressor.o
CC vfs_init.o
CC vfs_lookup.o
CC vm_compressor_pager.o
CC vm_phantom_cache.o
CC device_vm.o
CC vfs_quota.o
CC memory_object.o
CC vfs_subr.o
CC vm_debug.o
CC vfs_syscalls.o
CC vfs_support.o
CC vm_fault.o
CC vm_init.o
CC vfs_utfconv.o
CC vfs_vnops.o
CC vm_kern.o
CC vm_map.o
CC vfs_xattr.o
CC vnode_if.o
CC vm_map_store.o
CC vm_map_store_ll.o
CC vm_map_store_rb.o
CC kpi_vfs.o
CC vfs_journal.o
CC vfs_fsevents.o
CC vm_object.o
CC vm_pageout.o
CC vm_purgeable.o
CC dead_vnops.o
CC vm_resident.o
CC devfs_fdesc_support.o
CC fifo_vnops.o
CC spec_vnops.o
CC devfs_tree.o
CC vm_shared_region.o
CC vm_swapfile_pager.o
CC devfs_vnops.o
CC devfs_vfsops.o
CC decmpfs.o
CC vm_user.o
CC vm32_user.o
CC net_stubs.o
CC iokit_rpc.o
CC bpf.o
CC device_server.o
CC bpf_filter.o
CC if_bridge.o
CC if.o
CC device_init.o
CC init.o
CC dlil.o
CC kext_alloc.o
CC ether_if_module.o
CC kmod.o
CC subrs.o
CC ether_inet_pr_module.o
CC chud_cpu.o
CC ether_inet6_pr_module.o
CC chud_glue.o
CC chud_memory.o
CC if_loop.o
CC if_mib.o
CC chud_osfmk_callback.o
CC chud_thread.o
CC if_vlan.o
CC kperf.o
CC action.o
CC multicast_list.o
CC if_bond.o
CC devtimer.o
CC callstack.o
CC pet.o
CC ndrv.o
CC threadinfo.o
CC radix.o
CC timetrigger.o
CC kperf_kpc.o
CC raw_cb.o
CC kpc_thread.o
CC kpc_common.o
CC serial_general.o
CC raw_usrreq.o
CC route.o
CC telemetry.o
CC ccdrbg_nisthmac.o
CC rtsock.o
CC ccdigest_init.o
CC netsrc.o
CC ccdigest_update.o
CC cchmac.o
CC cchmac_init.o
CC cchmac_update.o
CC ntstat.o
CC cchmac_final.o
CC ccdigest_final_64be.o
CC if_gif.o
CC ccsha1_eay.o
CC ccsha1_initial_state.o
CC if_stf.o
CC random.o
CC prng_yarrow.o
CC fips_sha1.o
CC kpi_interface.o
CC kpi_protocol.o
CC smf.o
CC comp.o
CC prng.o
CC kpi_interfacefilter.o
CC sha1mod.o
CC net_str_id.o
CC yarrowUtils.o
CC if_utun.o
CC vm_apple_protect.o
CC pmap.o
CC if_utun_crypto.o
CC pmap_x86_common.o
CC pmap_common.o
CC if_utun_crypto_dtls.o
CC pmap_pcid.o
CC if_utun_crypto_ipsec.o
CC if_ipsec.o
CC pal_routines.o
CC necp.o
CC if_pflog.o
AS pal_routines_asm.o
CC pf.o
CC pf_if.o
AS start.o
CC pf_ioctl.o
AS bcopy.o
AS bzero.o
AS WKdmDecompress_new.o
AS WKdmCompress_new.o
AS WKdmData_new.o
AS i386_lock.o
AS locore.o
AS cswitch.o
AS machine_routines_asm.o
AS commpage_asm.o
AS fifo_queues.o
AS idt64.o
LDFILELIST osfmk
CC pf_norm.o
CC pf_osfp.o
CC pf_ruleset.o
CC pf_table.o
CC iptap.o
CC pktap.o
CC if_llreach.o
CC flowhash.o
CC flowadv.o
CC content_filter.o
CC packet_mangler.o
CC classq.o
CC classq_sfb.o
CC classq_subr.o
CC classq_util.o
CC pktsched.o
CC pktsched_qfq.o
CC pktsched_tcq.o
CC igmp.o
CC in.o
CC in_dhcp.o
CC dhcp_options.o
CC in_arp.o
CC in_mcast.o
CC in_pcb.o
CC in_pcblist.o
CC in_proto.o
CC in_rmx.o
CC in_tclass.o
CC ip_divert.o
CC ip_dummynet.o
CC ip_fw2.o
CC ip_fw2_compat.o
CC ip_icmp.o
CC ip_id.o
CC ip_input.o
CC ip_output.o
CC raw_ip.o
CC tcp_input.o
CC tcp_output.o
CC tcp_sack.o
CC tcp_subr.o
CC tcp_timer.o
CC tcp_usrreq.o
CC tcp_cc.o
CC tcp_newreno.o
CC tcp_cubic.o
CC cbrtf.o
CC tcp_lro.o
CC tcp_ledbat.o
CC udp_usrreq.o
CC in_gif.o
CC ip_ecn.o
CC ip_encap.o
CC kpi_ipfilter.o
CC flow_divert.o
CC mp_proto.o
CC mp_pcb.o
CC mptcp.o
CC mptcp_subr.o
CC mptcp_usrreq.o
CC mptcp_opt.o
CC mptcp_timer.o
CC ah_core.o
CC ah_input.o
CC ah_output.o
CC esp_core.o
CC esp_input.o
CC esp_output.o
CC esp_rijndael.o
CC ipsec.o
CC dest6.o
CC frag6.o
CC icmp6.o
CC in6.o
CC in6_cga.o
CC in6_cksum.o
CC in6_gif.o
CC ip6_fw.o
CC ip6_forward.o
CC in6_ifattach.o
CC ip6_input.o
CC ip6_output.o
CC in6_src.o
CC ipcomp_core.o
CC ipcomp_input.o
CC ipcomp_output.o
CC in6_mcast.o
CC in6_pcb.o
CC in6_proto.o
CC in6_rmx.o
CC mld6.o
CC nd6.o
CC nd6_nbr.o
CC nd6_prproxy.o
CC nd6_rtr.o
CC nd6_send.o
CC raw_ip6.o
CC route6.o
CC scope6.o
CC udp6_output.o
CC udp6_usrreq.o
CC ip6_id.o
CC key.o
CC key_debug.o
CC keysock.o
CC keydb.o
CC rc4.o
CC hfs_attrlist.o
CC hfs_btreeio.o
CC hfs_catalog.o
CC hfs_chash.o
CC hfs_cnode.o
CC hfs_encodinghint.o
CC hfs_encodings.o
CC hfs_endian.o
CC hfs_hotfiles.o
CC hfs_link.o
CC hfs_lookup.o
CC hfs_notification.o
CC hfs_quota.o
CC hfs_readwrite.o
CC hfs_resize.o
CC hfs_search.o
CC hfs_vfsops.o
CC hfs_vfsutils.o
CC hfs_vnops.o
CC hfs_xattr.o
CC MacOSStubs.o
CC hfs_cprotect.o
CC rangelist.o
CC BTree.o
CC BTreeAllocate.o
CC BTreeMiscOps.o
CC BTreeNodeOps.o
CC BTreeNodeReserve.o
CC BTreeScanner.o
CC BTreeTreeOps.o
CC CatalogUtilities.o
CC FileIDsServices.o
CC BTreeWrapper.o
CC FileExtentMapping.o
CC VolumeAllocation.o
CC UnicodeWrappers.o
CC audit.o
CC audit_arg.o
CC audit_bsd.o
CC audit_bsm.o
CC audit_bsm_errno.o
CC audit_bsm_fcntl.o
CC audit_bsm_domain.o
CC audit_bsm_klib.o
CC audit_bsm_socket_type.o
CC audit_bsm_token.o
CC audit_kevents.o
CC init_sysent.o
CC syscalls.o
LDFILELIST bsd
CC lastkernelconstructor.o
CC version.o
LD kernel.unstripped

 

 

no building kernel

  • Like 1
  • 2 weeks later...

Yes, this working xcode 6.1 on old's cpus !


Why didn't you do an archive and not posted ?
In the terminal you need to add "make" !
 
I compiled and created to archive ! 
Download -> LLVM_3.5_for_xcode !
Extract and copy folders "usr" and "lib" to <xcode Path>/Xcode.app/Contents/Developer/Toolchains/XcodeDefault.xctoolchain/usr !
Good luck ! :)

 

 

  • Like 5
×
×
  • Create New...