Jump to content

Chameleon Compiling Error


  • Please log in to reply
No replies to this topic

#1
Clideven

Clideven

    InsanelyMac Protégé

  • Members
  • PipPip
  • 54 posts
Hi leute

ich hab da mal ein kleines problem
ich bekomme es nicht mehr hin Chameleon zu Kompilieren egal welche revision ich mir auch lade es geht nicht
immer wieder bekomme ich den gleiche error
hier der error vom terminal:

In file included from /usr/include/sys/types.h:260, from /usr/include/sys/file.h:68, from dyldsymboltool.c:14: /usr/include/sys/_structs.h:200:14: error: operator '>' has no left operand make[3]: *** [/Users/leroy/Desktop/Chameleon-2.1/obj/i386/util/dyldsymboltool.o32] Error 1 make[2]: *** [all-recursive] Error 1 make[1]: *** [all-recursive] Error 1 make: *** [all] Error 2


bitte um hilfe falls da einer weiter weiss wäre echt spitze


Danke hat sich erledigt alles wieder ok!!!





0 user(s) are reading this topic

0 members, 0 guests, 0 anonymous users

© 2014 InsanelyMac  |   News  |   Forum  |   Downloads  |   OSx86 Wiki  |   Mac Netbook  |   Web hosting by CatN  |   Designed by Ed Gain  |   Logo by irfan  |   Privacy Policy