Jump to content
ErmaC

Clover General discussion

23,107 posts in this topic

Recommended Posts

Before 4488 its not an issue build Clover UDK2018 but now its failed

EDIT ***

4485 and Before 4485  its not an issue build Clover UDK2018

EDIT***  Think is broken after 4485, I test right now 4485 and I report 

4485 is good 

 

So after 4485 not working here

EDIT 2 ***

got it now problem fix wit

copying the /Patches_for_UDK2018/* ~/src/UDK2018/ 

Sorry my bad I cp-rf the old patch for edk2

 

 

 

 

Edited by chris1111

Share this post


Link to post
Share on other sites
Advertisement

What is the difference between "DSDT" and "RenameDevices" in the ACPI section? In both cases, can I do the same?

tata.png

Share this post


Link to post
Share on other sites

no matter which tool i will use to build the latest CLOVER rev. - i will always get the same error:

Spoiler

Building CloverUpdater application...
[XCODE]
Building CloverPrefpane preference...
[XCODE]
================= Making all in fdisk440 =================
	[MKDIR] /Users/md/src/UDK2018/Clover/CloverPackage/sym/build/fdisk440
	[CC32] auto.c
	[CC32] cmd.c
	[CC32] disk.c
	[CC32] fdisk.c
	[CC32] getrawpartition.c
	[CC32] mbr.c
	[CC32] misc.c
	[CC32] opendev.c
	[CC32] part.c
	[CC32] user.c
	[CC64] auto.c
	[CC64] cmd.c
	[CC64] disk.c
	[CC64] fdisk.c
	[CC64] getrawpartition.c
	[CC64] mbr.c
	[CC64] misc.c
	[CC64] opendev.c
	[CC64] part.c
	[CC64] user.c
	[LD32] fdisk440_32
	[LD64] fdisk440_64
	[LIPO] /Users/md/src/UDK2018/Clover/CloverPackage/sym/utils/fdisk440
================= Making all in boot1-install =================
	[XCODE] boot1-install
================= Making all in partutil =================
	[XCODE] partutil
================= Making all in bdmesg =================
	[XCODE] bdmesg
================= Making all in clover-genconfig =================
	[XCODE] clover-genconfig
** INSTALL FAILED **


The following build commands failed:
	CompileC /Users/md/src/UDK2018/Clover/CloverPackage/sym/build/clover-genconfig/clover-genconfig.build/Release/clover-genconfig.build/Objects-normal/i386/clover-genconfig.o clover-genconfig.c normal i386 c com.apple.compilers.llvm.clang.1_0.compiler
(1 failure)
make[2]: *** [/Users/md/src/UDK2018/Clover/CloverPackage/sym/utils/clover-genconfig] Error 65
make[1]: *** [all-recursive] Error 1
make: *** [pkg] Error 2

=========================== Make Clover ISO =================================

================= Making all in fdisk440 =================
make[2]: Nothing to be done for `all'.
================= Making all in boot1-install =================
make[2]: Nothing to be done for `all'.
================= Making all in partutil =================
make[2]: Nothing to be done for `all'.
================= Making all in bdmesg =================
make[2]: Nothing to be done for `all'.
================= Making all in clover-genconfig =================
	[XCODE] clover-genconfig
** INSTALL FAILED **


The following build commands failed:
	CompileC /Users/md/src/UDK2018/Clover/CloverPackage/sym/build/clover-genconfig/clover-genconfig.build/Release/clover-genconfig.build/Objects-normal/i386/clover-genconfig.o clover-genconfig.c normal i386 c com.apple.compilers.llvm.clang.1_0.compiler
(1 failure)
make[2]: *** [/Users/md/src/UDK2018/Clover/CloverPackage/sym/utils/clover-genconfig] Error 65
make[1]: *** [all-recursive] Error 1
make: *** [utils] Error 2

Complete Build time 1m28s

================ Finish working: 2018-05-23 22:45:04 +0200 ===================

Syncing disk cache ... Done.

All done.
Have a nice ... day(night)
Enjoy ...

 

at the same part of the script. Tried with latest CloverBuilder 1.1.6 and Build Clover 4.8.4.sh script.

Seems to be broken since rev. 4496, cause building rev. 4495 allready worked for me at least. Anyone have any clue?

btw: i always build from the beginning by deleting the "src" folder in my homefolder location.

 

ps: the whole log file is attached as a download

clover_build_rev4497_log.rtf

Edited by Mork vom Ork

Share this post


Link to post
Share on other sites

Sorry and very OT, but my question (after googling):

Can I get rid of apfs without reinstalling? Would like to convert back to HFS. Is there a programm or an app?? For me apfs is feels much slower.

Share this post


Link to post
Share on other sites
8 hours ago, Mork vom Ork said:

no matter which tool i will use to build the latest CLOVER rev. - i will always get the same error:

  Reveal hidden contents


Building CloverUpdater application...
[XCODE]
Building CloverPrefpane preference...
[XCODE]
================= Making all in fdisk440 =================
	[MKDIR] /Users/md/src/UDK2018/Clover/CloverPackage/sym/build/fdisk440
	[CC32] auto.c
	[CC32] cmd.c
	[CC32] disk.c
	[CC32] fdisk.c
	[CC32] getrawpartition.c
	[CC32] mbr.c
	[CC32] misc.c
	[CC32] opendev.c
	[CC32] part.c
	[CC32] user.c
	[CC64] auto.c
	[CC64] cmd.c
	[CC64] disk.c
	[CC64] fdisk.c
	[CC64] getrawpartition.c
	[CC64] mbr.c
	[CC64] misc.c
	[CC64] opendev.c
	[CC64] part.c
	[CC64] user.c
	[LD32] fdisk440_32
	[LD64] fdisk440_64
	[LIPO] /Users/md/src/UDK2018/Clover/CloverPackage/sym/utils/fdisk440
================= Making all in boot1-install =================
	[XCODE] boot1-install
================= Making all in partutil =================
	[XCODE] partutil
================= Making all in bdmesg =================
	[XCODE] bdmesg
================= Making all in clover-genconfig =================
	[XCODE] clover-genconfig
** INSTALL FAILED **


The following build commands failed:
	CompileC /Users/md/src/UDK2018/Clover/CloverPackage/sym/build/clover-genconfig/clover-genconfig.build/Release/clover-genconfig.build/Objects-normal/i386/clover-genconfig.o clover-genconfig.c normal i386 c com.apple.compilers.llvm.clang.1_0.compiler
(1 failure)
make[2]: *** [/Users/md/src/UDK2018/Clover/CloverPackage/sym/utils/clover-genconfig] Error 65
make[1]: *** [all-recursive] Error 1
make: *** [pkg] Error 2

=========================== Make Clover ISO =================================

================= Making all in fdisk440 =================
make[2]: Nothing to be done for `all'.
================= Making all in boot1-install =================
make[2]: Nothing to be done for `all'.
================= Making all in partutil =================
make[2]: Nothing to be done for `all'.
================= Making all in bdmesg =================
make[2]: Nothing to be done for `all'.
================= Making all in clover-genconfig =================
	[XCODE] clover-genconfig
** INSTALL FAILED **


The following build commands failed:
	CompileC /Users/md/src/UDK2018/Clover/CloverPackage/sym/build/clover-genconfig/clover-genconfig.build/Release/clover-genconfig.build/Objects-normal/i386/clover-genconfig.o clover-genconfig.c normal i386 c com.apple.compilers.llvm.clang.1_0.compiler
(1 failure)
make[2]: *** [/Users/md/src/UDK2018/Clover/CloverPackage/sym/utils/clover-genconfig] Error 65
make[1]: *** [all-recursive] Error 1
make: *** [utils] Error 2

Complete Build time 1m28s

================ Finish working: 2018-05-23 22:45:04 +0200 ===================

Syncing disk cache ... Done.

All done.
Have a nice ... day(night)
Enjoy ...

 

at the same part of the script. Tried with latest CloverBuilder 1.1.6 and Build Clover 4.8.4.sh script.

Seems to be broken since rev. 4496, cause building rev. 4495 allready worked for me at least. Anyone have any clue?

btw: i always build from the beginning by deleting the "src" folder in my homefolder location.

 

ps: the whole log file is attached as a download

clover_build_rev4497_log.rtf

Another issue here with commits r4997? I don't understand why.

 

I insert new sync EDK2 -27233 in Build_Clover.command script. I launch the script from scratch to new src folder: all work fine.... until makepkg function error message:

 

invalid option!!
Segmentation fault: 11

 

Edited by Matgen84

Share this post


Link to post
Share on other sites
3 hours ago, Matgen84 said:

Another issue here with commits r4997? I don't understand why.

 

I insert new sync EDK2 -27233 in Build_Clover.command script. I launch the script from scratch to new src folder: all work fine.... until makepkg function error message:

 

invalid option!!
Segmentation fault: 11

 

The exit code of several external commands was not handled correctly, causing this script loop and Segmentation fault after that, so I've just pushed a new script version to the work branch. Try it and you'll see the real cause for this fault.

Edited by Philip Petev

Share this post


Link to post
Share on other sites

@Mork vom Ork, @Matgen84:

There was problem in clover-genconfig build settings after reversion of MdePkg/Include/Base.h that was causing its build to fail.  Try r4498.  Should be ok now.

 

PS: The problem was that it was building combined 32/64-bit binary, and the 32-bit build, for some reason defines MDE_CPU_X64.  I didn't bother to figure out why it's defining this symbol, but now it's only building the 64-bit build - which should be ok, since 64-bit user mode is supported since OS X Leopard.

Edited by Zenith432

Share this post


Link to post
Share on other sites



================================================================================

Build_Clover script v4.8.4                                  No update available.

                             <--------------------------------------------------

================================================================================

By Micky1979 based on Slice, apianti, vit9696, Download Fritz, Zenith432,

STLVNUB, JrCs,cecekpawon, Needy, cvad, Rehabman, philip_petev, ErmaC

 

Supported OSes: macOS X, Ubuntu (16.04/16.10), Debian Jessie and Stretch

                             <--------------------------------------------------

CLOVER Remote revision: 4498 Local revision: 4498

EDK2 Remote revision: 27236 Local revision: 27213

 

The current local EDK2 revision is the suggested one (27213). 

Used settings: /Users/shane/BuildCloverConfig.txt 

                             <--------------------------------------------------

Please enter your choice: 

 1) update Clover only (no building)

 2) update Clover + force edk2 update (no building)

 3) run my script on the source

 4) build existing revision (no update, for testing only)

 5) build existing revision for release (no update, standard build)

 6) build existing revision with custom macros enabled

 7) enter Developers mode (only for devs)

 8) Try Clover Configurator Pro.app

 9) edit the configuration file

 10) Exit

? 5

 

 

 

 

 

 

 

================================================================================

Select the desired architecture

                             <--------------------------------------------------

1) Standard x64 only

2) ia32 and x64 (ia32 is deprecated)

3) ia32 only (deprecated)

4) Back to Main Menu

5) Exit

? 1

 

 

 

 

 

 

 

 

 

 

 

 

 

 

 

 

 

 

 

 

 

 

 

 

 

================================================================================

Select the desired pkg type

                             <--------------------------------------------------

1) Standard

2) slim pkg that skip themes and CloverThemeManager.app

3) slim pkg that skip themes and CloverThemeManager.app, updater and PrefPanel

4) slim pkg UEFI only, without RC Scripts, themes & CTM, updater and PrefPanel

5) Back to Select architecture menu

6) Exit

? 

 

 

 

 

 

 

 

 

 

 

 

 

 

 

 

 

 

 

 

 

 

 

 

 

================================================================================

Select the desired pkg type

                             <--------------------------------------------------

invalid choice!

 

1) Standard

2) slim pkg that skip themes and CloverThemeManager.app

3) slim pkg that skip themes and CloverThemeManager.app, updater and PrefPanel

4) slim pkg UEFI only, without RC Scripts, themes & CTM, updater and PrefPanel

5) Back to Select architecture menu

6) Exit

? 1

================================================================================

Running from: macOS 10.13.5

Xcode 9.3.1

Build version 9E501

                             <--------------------------------------------------

================================================================================

Compiler settings

                             <--------------------------------------------------

Configured with: --prefix=/Applications/Xcode.app/Contents/Developer/usr --with-gxx-include-dir=/usr/include/c++/4.2.1

Apple LLVM version 9.1.0 (clang-902.0.39.1)

Target: x86_64-apple-darwin17.6.0

Thread model: posix

InstalledDir: /Applications/Xcode.app/Contents/Developer/Toolchains/XcodeDefault.xctoolchain/usr/bin

                             <--------------------------------------------------

================================================================================

BUILDTOOL is XCODE8

                             <--------------------------------------------------

 

================================================================================

nasm check:

                             <--------------------------------------------------

NASM version 2.13.03 compiled on Feb  7 2018

================================================================================

gettext check:

                             <--------------------------------------------------

found gettext at /Users/shane/src/opt/local/bin

================================================================================

mtoc check:

                             <--------------------------------------------------

mtoc found in /Users/shane/src/opt/local/bin.

================================================================================

 

Loading previous configuration from /Users/shane/src/edk2/Conf/BuildEnv.sh

WORKSPACE: /Users/shane/src/edk2

EDK_TOOLS_PATH: /Users/shane/src/edk2/BaseTools

CONF_PATH: /Users/shane/src/edk2/Conf

Build environment: Darwin-17.6.0-x86_64-i386-64bit

Build start time: 19:06:43, May.24 2018

 

WORKSPACE        = /Users/shane/src/edk2

ECP_SOURCE       = /Users/shane/src/edk2/EdkCompatibilityPkg

EDK_SOURCE       = /Users/shane/src/edk2/EdkCompatibilityPkg

EFI_SOURCE       = /Users/shane/src/edk2/EdkCompatibilityPkg

EDK_TOOLS_PATH   = /Users/shane/src/edk2/BaseTools

CONF_PATH        = /Users/shane/src/edk2/Conf

 

 

Architecture(s)  = X64

Build target     = RELEASE

Toolchain        = XCODE8

 

Active Platform          = /Users/shane/src/edk2/AptioFixPkg/AptioFixPkg.dsc

 

Processing meta-data . done!

Building ... /Users/shane/src/edk2/MdePkg/Library/UefiUsbLib/UefiUsbLib.inf [X64]

make: Nothing to be done for `tbuild'.

Building ... /Users/shane/src/edk2/MdePkg/Library/UefiDriverEntryPoint/UefiDriverEntryPoint.inf [X64]

make: Nothing to be done for `tbuild'.

Building ... /Users/shane/src/edk2/MdeModulePkg/Library/UefiHiiLib/UefiHiiLib.inf [X64]

Building ... /Users/shane/src/edk2/MdePkg/Library/UefiLib/UefiLib.inf [X64]

Building ... /Users/shane/src/edk2/MdeModulePkg/Library/UefiHiiServicesLib/UefiHiiServicesLib.inf [X64]

make: Nothing to be done for `tbuild'.

Building ... /Users/shane/src/edk2/MdePkg/Library/UefiRuntimeServicesTableLib/UefiRuntimeServicesTableLib.inf [X64]

/Users/shane/src/edk2/MdeModulePkg/Library/UefiHiiLib/HiiLib.c:165:20: error: 'va_start' used in Win64 ABI function

  for (Length = 0, VA_START (Args, DeviceHandle); (Package = VA_ARG (Args, UINT32 *)) != NULL; ) {

                   ^

/Users/shane/src/edk2/MdePkg/Include/Base.h:740:38: note: expanded from macro 'VA_START'

#define VA_START(Marker, Parameter)  __builtin_va_start (Marker, Parameter)

                                     ^

/Users/shane/src/edk2/MdeModulePkg/Library/UefiHiiLib/HiiLib.c:209:8: error: 'va_start' used in Win64 ABI function

  for (VA_START (Args, DeviceHandle); (Package = VA_ARG (Args, UINT32 *)) != NULL; ) {

       ^

/Users/shane/src/edk2/MdePkg/Include/Base.h:740:38: note: expanded from macro 'VA_START'

#define VA_START(Marker, Parameter)  __builtin_va_start (Marker, Parameter)

                                     ^

make: Nothing to be done for `tbuild'.

Building ... /Users/shane/src/edk2/MdePkg/Library/UefiDevicePathLib/UefiDevicePathLib.inf [X64]

2 errors generated.

make: *** [/Users/shane/src/edk2/Build/AptioFixPkg/RELEASE_XCODE8/X64/MdeModulePkg/Library/UefiHiiLib/UefiHiiLib/OUTPUT/HiiLib.obj] Error 1

 

 

build.py...

 : error 7000: Failed to execute command

make tbuild [/Users/shane/src/edk2/Build/AptioFixPkg/RELEASE_XCODE8/X64/MdeModulePkg/Library/UefiHiiLib/UefiHiiLib]

 

 

build.py...

 : error 7000: Failed to execute command

make tbuild [/Users/shane/src/edk2/Build/AptioFixPkg/RELEASE_XCODE8/X64/MdePkg/Library/UefiLib/UefiLib]

 

 

build.py...

 : error 7000: Failed to execute command

make tbuild [/Users/shane/src/edk2/Build/AptioFixPkg/RELEASE_XCODE8/X64/MdePkg/Library/UefiDevicePathLib/UefiDevicePathLib]

 

 

build.py...

 : error F002: Failed to build module

/Users/shane/src/edk2/MdeModulePkg/Library/UefiHiiLib/UefiHiiLib.inf [X64, XCODE8, RELEASE]

 

- Failed -

Build end time: 19:06:45, May.24 2018

Build total time: 00:00:02

 

================================================================================

boot6

                             <--------------------------------------------------

TOOLCHAIN_DIR: /Users/shane/src/opt/local

MTOC_PREFIX: /Users/shane/src/opt/local/bin/

NASM_PREFIX: /Users/shane/src/opt/local/bin/

NASM_VER: 2.13.03

Building from: /Users/shane/src/edk2

 

Running edk2 build for CloverX64 using the command:

build  -D NO_GRUB_DRIVERS_EMBEDDED --conf=/Users/shane/src/edk2/Conf -D USE_LOW_EBDA -p Clover/Clover.dsc  -a X64 -b RELEASE -t XCODE8 -n 9 

 

Build environment: Darwin-17.6.0-x86_64-i386-64bit

Build start time: 19:06:45, May.24 2018

 

WORKSPACE        = /Users/shane/src/edk2

ECP_SOURCE       = /Users/shane/src/edk2/EdkCompatibilityPkg

EDK_SOURCE       = /Users/shane/src/edk2/EdkCompatibilityPkg

EFI_SOURCE       = /Users/shane/src/edk2/EdkCompatibilityPkg

EDK_TOOLS_PATH   = /Users/shane/src/edk2/BaseTools

CONF_PATH        = /Users/shane/src/edk2/Conf

 

 

Architecture(s)  = X64

Build target     = RELEASE

Toolchain        = XCODE8

 

Active Platform          = /Users/shane/src/edk2/Clover/Clover.dsc

Flash Image Definition   = /Users/shane/src/edk2/Clover/Clover.fdf

 

Processing meta-data .... done!

Building ... /Users/shane/src/edk2/MdePkg/Library/BaseIoLibIntrinsic/BaseIoLibIntrinsic.inf [X64]

Building ... /Users/shane/src/edk2/MdePkg/Library/BaseReportStatusCodeLibNull/BaseReportStatusCodeLibNull.inf [X64]

make: Nothing to be done for `tbuild'.

make: Nothing to be done for `tbuild'.

Building ... /Users/shane/src/edk2/MdePkg/Library/BasePrintLib/BasePrintLib.inf [X64]

Building ... /Users/shane/src/edk2/MdePkg/Library/BaseLib/BaseLib.inf [X64]

Building ... /Users/shane/src/edk2/MdePkg/Library/BaseMemoryLib/BaseMemoryLib.inf [X64]

/Users/shane/src/edk2/MdePkg/Library/BasePrintLib/PrintLibInternal.c:1265:3: error: 'va_start' used in Win64 ABI function

make: Nothing to be done for `tbuild'.

  VA_START (Marker, FormatString);

  ^

/Users/shane/src/edk2/MdePkg/Include/Base.h:740:38: note: expanded from macro 'VA_START'

#define VA_START(Marker, Parameter)  __builtin_va_start (Marker, Parameter)

                                     ^

1 error generated.

make: *** [/Users/shane/src/edk2/Build/Clover/RELEASE_XCODE8/X64/MdePkg/Library/BasePrintLib/BasePrintLib/OUTPUT/PrintLibInternal.obj] Error 1

 

 

build.py...

 : error 7000: Failed to execute command

make tbuild [/Users/shane/src/edk2/Build/Clover/RELEASE_XCODE8/X64/MdePkg/Library/BasePrintLib/BasePrintLib]

 

 

build.py...

 : error 7000: Failed to execute command

make tbuild [/Users/shane/src/edk2/Build/Clover/RELEASE_XCODE8/X64/MdePkg/Library/BaseLib/BaseLib]

 

 

build.py...

 : error F002: Failed to build module

/Users/shane/src/edk2/MdePkg/Library/BasePrintLib/BasePrintLib.inf [X64, XCODE8, RELEASE]

 

- Failed -

Build end time: 19:06:51, May.24 2018

Build total time: 00:00:05

 

 

o_Ops, ./ebuild.sh exited with error(s), aborting..

Share this post


Link to post
Share on other sites
5 minutes ago, Zenith432 said:

@SavageAUS: Your patches are misapplied.  You need to revert patches to EDK2, update to latest from SVN and then reapply the patches.

I deleted src folder and re-ran, still same issue.

Share this post


Link to post
Share on other sites
24 minutes ago, SavageAUS said:

I deleted src folder and re-ran, still same issue.

I don't know what "src folder" is.  Your log says EDK2 rev 27213.  For Clover 4498 you should use at least 27233 of EDK2.  In EDK2 tree, MdePkg/Include/Base.h should be reverted to original.  Then Clover/Patches_for_EDK2 recopied over EDK2.

Share this post


Link to post
Share on other sites
6 minutes ago, Zenith432 said:

I don't know what "src folder" is.  Your log says EDK2 rev 27213.  For Clover 4498 you should use at least 27233 of EDK2.  In EDK2 tree, MdePkg/Include/Base.h should be reverted to original.  Then Clover/Patches_for_EDK2 recopied over EDK2.

Problem solved, thanks.

Share this post


Link to post
Share on other sites

Clover r4498 broke my audio. ALC1150. Any idea why? I reverted back to clover r4492 and it works as it supposed to.

 

Using AppleALC v.1.2.6 and Lilu v.1.2.3

Share this post


Link to post
Share on other sites

Hi,the AppleALC injector doesn't work since I update the version of clover to r4497,and this problem is also been found in r4498  or r4499,but it works in r4496. Could you please fix it and test that? My Audio Codec is Realtek ALC1220, works with layout ID=11.

 

best regards

Edited by wyhtc

Share this post


Link to post
Share on other sites
16 hours ago, Cyberdevs said:

Clover r4498 broke my audio. ALC1150. Any idea why? I reverted back to clover r4492 and it works as it supposed to.

 

Using AppleALC v.1.2.6 and Lilu v.1.2.3

 

15 hours ago, iCanaro said:

Clover 4497 and 4498  not load the ID layout (layout 0) tested my hack 1 and 2

 

14 hours ago, wyhtc said:

Hi,the AppleALC injector doesn't work since I update the version of clover to r4497,and this problem is also been found in r4498  or r4499,but it works in r4496. Could you please fix it and test that? My Audio Codec is Realtek ALC1220, works with layout ID=11.

 

best regards

Yes, file Settings.c lines 5048 and 5051 should be added

gSettings.HDAInjection = TRUE;
Previously this was by default, but since 4497 I don't want any default injection because Properties will be full enough.

Share this post


Link to post
Share on other sites

While I do agree that this is a problem on Clover side (and now I know why), this doesn't seem to occur on my Skylake system (ALC 1150)... Which is weird...

 

The config is slightly different than my home setup (the one in the signature), of course, but the Audio injection is set up pretty much the same way. So...not sure why it works for the Skylake build, but not for the Haswell build, with the exact same kexts (Lilu & AppleALC).

 

@Slice personally I'm a bit confused regarding your explanation. Are you saying, staring with 4497 we won't have audio again, unless we (I mean the users in general) change that line in Settings.c...? Cause, I'm pretty sure most of the users either don't know how to do that, or simply won't do that.

Also, I'm still not sure how does it work on my Skylake build though. With the same Clover 4497.

 

Is there something we can do from config in order to have sound? Cause I thought adding the Layout ID (in my case "1") is what we have to do. If that's not necessary anymore, and we can still have sound another way, could you, please, tell me what to do to get that done?

 

For now, I simply reverted to previous version. But...I would like to be able to upgrade to the newer versions in the future, without losing sound.

 

So, I guess my question is simple: is there another way to get sound back, other than editing that line in Settings.c which...I suppose would also mean re-compiling Clover by ourselves?

Edited by arsradu

Share this post


Link to post
Share on other sites
8 minutes ago, SavageAUS said:

I havnt tested audio on my skylake build but on my haswell laptop i have audio.

I guess its working because audio layout is set in DSDT?

 

Bingo!

 

FixHDA in DSDT Fixes...is what makes it work on my Skylake build. I'm pretty sure that's not enabled on my Haswell build.

 

So, I would suggest anyone with this issue to just enable FixHDA in DSDT Fixes and...that should be it. Everything else stays the same.

 

Thank you very much! :)

 

@Slice all good, man. Thank you! :)

Edited by arsradu

Share this post


Link to post
Share on other sites
1 hour ago, Slice said:

 

 

Yes, file Settings.c lines 5048 and 5051 should be added

gSettings.HDAInjection = TRUE;
Previously this was by default, but since 4497 I don't want any default injection because Properties will be full enough.

Thank you,Slice. I will try.

Share this post


Link to post
Share on other sites

 

 

what about this? Did you arrange Clover only UEFI now?

Several problems Booting Legacy (ESP)  last revision clover 4498 and 4499 BUILD UDK2018
I can not say what revision it was to break?

1510971873_screenshot4.thumb.png.28284abb420341a5851dcbac42f9faf0copie.png.4f99d4eebf6e9d94d44b98cf9e9c4345.png

Edited by chris1111

Share this post


Link to post
Share on other sites
1 hour ago, SavageAUS said:

I havnt tested audio on my skylake build but on my haswell laptop i have audio.

I guess its working because audio layout is set in DSDT?

I don't use DSDT on my SkyLake rig anymore.

 

1 hour ago, arsradu said:

 

Bingo!

 

FixHDA in DSDT Fixes...is what makes it work on my Skylake build. I'm pretty sure that's not enabled on my Haswell build.

 

So, I would suggest anyone with this issue to just enable FixHDA in DSDT Fixes and...that should be it. Everything else stays the same.

 

Thank you very much! :)

FixHDA also don't fix my problem.

 

2 hours ago, Slice said:

 

 

Yes, file Settings.c lines 5048 and 5051 should be added

gSettings.HDAInjection = TRUE;
Previously this was by default, but since 4497 I don't want any default injection because Properties will be full enough.

Is there a way to add those properties in the config.plist? can you please clarify your statement a little more on how to add those properties without having to edit the settings.c?

Share this post


Link to post
Share on other sites

Create an account or sign in to comment

You need to be a member in order to leave a comment

Create an account

Sign up for a new account in our community. It's easy!

Register a new account

Sign in

Already have an account? Sign in here.

Sign In Now

Announcements

  • Similar Content

    • By MaLd0n
      -OpenCore Vanilla TUTORIAL-
       
       
      -USB Port Mapping TUTORIAL-
       
        1 -Create a USB bootable
       
      Create your usb installer, use this tool and download Catalina or Big Sur from Apple servers
       
      Catalina
      installScript_allfullapp.zip
       
      Big Sur
      installScript_1016fullapp.zip
       
      Credits: crazybirdy
       
      Copy Catalina / Big Sur installer to Applications folder, open terminal and run
       
      Catalina
       
       
      Big Sur
       
       
      If you want check one step by step, check here
       
      -Opencore Vanilla Tutorial
      https://tinyurl.com/ycvcnp8h
       
      2- EFI folder USB installation
       
      -EFI OpenCore Folder Desktop 10th Intel Processors
      Paste this EFI folder in EFI partition in your USB STICK
      https://tinyurl.com/ybwr9kq3
       
      -EFI Clover Folder Desktop 10th Intel Processors
      Paste this EFI folder in EFI partition in your USB STICK
      https://tinyurl.com/yxsw7d3t
       
      3- EFI folder SSD
       
      -EFI OpenCore Folder Desktop 10th Intel Processors
      Paste this EFI folder in EFI partition SSD 
      https://tinyurl.com/ybwr9kq3
       
      -EFI Clover Folder Desktop 10th Intel Processors
      Paste this EFI folder in EFI partition SSD
      https://tinyurl.com/yxsw7d3t
       
      4- Start Fine Tune
       
      Run this app and post full dump here for full ACPI solution
       
      RunMe.app
      https://tinyurl.com/y9562hz7
       
       
      If you like a SSDT way, here we go
      SSDT-OLARILA.aml.zip
       
      5- USB Solution
       
      Use these kexts, enable XHCI port limit patch
       
      USB INTEL SERIE 400.zip
       
      and follow this tutorial for remap USB ports
       
       
      --DSDT PATCHES--
       
      -FIX ERRORS AND WARNINGS -FIX ACPI ERRORS -REMOVE UNUSED SCOPES / DEVICES -HIGH PRECISION EVENT TIMER -SATA SERIE ID -DMAC -REMOVE LINES, PROBLEMATIC and UNUSED -FIX K.P in REBOOT -NVRAM -REAL TIME CLOCK -SLPB -DARWIN / WINDOWS -XHCI -PLUGIN TYPE -HDEF -ARTC -IPIC -TIMR -SBUS -BUS1 -MCHC -ALS0 -SHUTDOWN -UAR1 -LAN -FWHD -USBX -PMCR -PPMC -XSPI -kUSBCompanionIndex -io-device-location -IMEI -EC -PNLF -ARPT -GFX0 -NVME -ACPI-WAKE-GPE -DTGP -HDMI / HDAU  
      --SCREENSHOTS--































      -If you want to buy me a beer - Donations with PayPal
      https://tinyurl.com/r2bvzm7
       
      Big Thanks to XLR and your Badass Motherboard, Ultrafast CPU, Coolest Heatsink, Huge Graphics Card, Tonnes of RAM,
      Gigantic Hard Drive, Lightspeed Disk Burner, Professional Sound Card, Massive LCD Display.
       
       
      -Credits and thanks to the old and new people in the community who developed patches, kexts and bootloaders!
      Slice, Kabyl, usr-sse2, jadran, Blackosx, dmazar, STLVNUB, pcj, apianti, JrCs, pene, FrodoKenny, skoczy, ycr.ru, Oscar09, xsmile, SoThOr, RehabMan, Download-Fritz, Zenit432, cecekpawon, Intel, Apple, Oracle, Chameleon Team, crazybirdy, Mieze, Mirone, Oldnapalm, netkas, Elconiglio, artut-pt, ErmaC, Pavo, Toleda, Master Chief and family, bcc9, The King, PMheart, Sherlocks, Micky1979, vit9696, vandroiy2013, Voodoo Team, Pike R. Alpha, lvs1974, Austere.J, CVad and many, many, many others!

      We're all here to have fun and learn from each other!
    • By Nomade
      Hello All,
       
      It's been a while that I am trying to update my system to 10.15.16.
      The install seem to start, then at reboot time I only see the Normal boot and the Recovery option from the Clover boot menu.
      None of those 2 allow to complete the update.
       
      Is there any ways to force it to install and/or show the "Update" option on the Clover boot screen?
       
      PS: I'm using Z97-Gaming-3
    • By Damx
      The specs CPU: Intel® Core™ i3 Processor 8130U, 2.20 GHz (Kaby Lake Refresh) Chipset: Intel® 300 Series Graphics: Intel® UHD Graphics 620 Display: 21.5'' 1920x1200 RAM: DDR4 PC2400 4GB SSD1: M.2 PLEXTOR (with original Windows 10) SSD2: SATA SAMSUNG 850 EVO (for macOS) Sound: Realtek ALC269 WiFi / BT: Intel 3168 NGW Realtek Card-reader  
       
      Not working
      WiFi: Intel 3168 NGW Realtek Card-reader  
       
      Pre-Installation
       
      I will not go through the basics since it is explained in details here on this site. Briefly, the process is to:
      Get Clover Get Catalina macOS installer Create USB with 2 MBR partitions (FAT32 for Clover and HFS+J for the installer)  
       
      Required kexts
      AppleALC.kext Lilu.kext RealtekRTL8111.kext VirtualSMC.kext WhateverGreen.kext  
       
      Config.plist
      I used the one provided by RehabMan called config_HD615_620_630_640_650.plist. Download it from GitHub. It has almost everything you will need with only few edits for audio.
      Edits:
      [CPU] Make sure there is lilcpu=9 setting in boot arguments needed for Kaby Lake R CPU to be recognised correctly. [GPU] Make sure there is a patch GFX0 to IGPU under ACPI->DSDT [GPU] Under Devices->Properties->PciRoot(0)/Pci(0x02,0) make sure that the AAPL,ig-platform-id value is 00001B59, and the device-id value is 16590000 [AUDIO] Under Devices->Properties->PciRoot(0)/Pci(0x1f,3) set the layout-id to 40 and the device-id to 70A10000 [SMBIOS] Set Mac model ID is iMac19,2  

       

       
      Notes
      For some reason with latest version of Clover the install partition was not visible. If you run into the same issue you can downgrade Clover to r5103, which worked perfectly. WiFi / BT Intel 3168 NGW needs to be replaced if one needs WiFi. Someone mentioned that to get HDMI work properly you may need to change AAPL,ig-platform-id value to 00001659 for PciRoot(0)/Pci(0x02,0) - not my case but may be considered if you get this issue. Don't forget to generate your serial and other SMBUS values before signing in with iCloud services.  
       
    • By MaLd0n
      A very custom DSDT for best experience under macOS. Removed all unused devices, injected all Apple devices, essentials, cosmetics, real improvements. 
       
      -OpenCore Vanilla TUTORIAL-
       
       
      -USB Port Mapping TUTORIAL-
       
          -Original DSDT have 167,880 lines and 762kb
       
      DSDT ORIGINAL.aml.zip138.01 kB · 8 downloads
       
      -Patched DSDT have 30,912 lines and 111kb
       
      DSDT PATCHED.aml.zip27.01 kB · 17 downloads
       
      --Hardware--
      Asus ROG RAMPAGE VI EXTREME OMEGA

      Processor  Intel i9-10980XE

      GPU Radeon RX 5700 XT

      --DSDT Patches--
      -FIX ERRORS AND WARNINGS -FIX ACPI ERRORS -REMOVE UNUSED SCOPES / DEVICES -HIGH PRECISION EVENT TIMER -SATA SERIE ID -DMAC -REMOVE LINES, PROBLEMATIC and UNUSED -REAL TIME CLOCK -SLPB -DARWIN / WINDOWS -XHCI -PLUGIN TYPE -HDEF -ARTC -IPIC -TIMR -SBUS -BUS1 -MCHC -ALS0 -SHUTDOWN -UAR1 -LAN -FWHD -USBX -XSPI -EC -PNLF -ARPT -GFX0 -NVME  
      --Screenshots-



















       
      -Credits and thanks to the old and new people in the community who developed patches, kexts and bootloaders!
      Slice, Kabyl, usr-sse2, jadran, Blackosx, dmazar, STLVNUB, pcj, apianti, JrCs, pene, FrodoKenny, skoczy, ycr.ru, Oscar09, xsmile, SoThOr, RehabMan, Download-Fritz, Zenit432, cecekpawon, Intel, Apple, Oracle, Chameleon Team, crazybirdy, Mieze, Mirone, Oldnapalm, netkas, Elconiglio, artut-pt, ErmaC, Pavo, Toleda, Master Chief and family, bcc9, The King, PMheart, Sherlocks, Micky1979, vit9696, vandroiy2013, Voodoo Team, Pike R. Alpha, lvs1974, Austere.J, CVad and many, many, many others!

      We're all here to have fun and learn from each other!
    • By MaLd0n
      -OpenCore Vanilla TUTORIAL-
       
       
      -USB Port Mapping TUTORIAL-
       
          -Wifi card has been replaced with Dell DW1560!
      -I'm using a S145 Model with Intel Core i5-1035G1 IceLake / Intel HD Graphics ICL
      -Update bios/uefi to last version 
       
      *For now we have 2 problems. Wake from sleep and some bugs in trackpad*
       
      --Bios/UEFI config--
      Go to Security tab and disable Secure boot
       
      -IceLake Premade installation Folder (easy way installation)
      https://tinyurl.com/y3tl6xlx
       
      --Clover and OpenCore Folders--
      Just paste EFI folder inside EFI partition
      -OpenCore
      https://tinyurl.com/y3c4rjkr
      -Clover
      https://tinyurl.com/y4496nq8
       
      --Enable Trackpad Dragging Option--
      Go to System Preferences/Accessibility/PointerControl/Trackpad Options and "Enable dragging"

      -Bluetooth Broadcom
       
      BrcmBluetoothInjector.zip2.46 MB · 4 downloads
       
      -OcQuirks.efi for Clover (Just replace Drivers folder)
       
      drivers.zip74.57 kB · 4 downloads
       
      --DSDT Patches--

      -Patches
      -FIX ERRORS AND WARNINGS -REMOVE UNUSED SCOPES / DEVICES -HIGH PRECISION EVENT TIMER -SATA SERIE 12 ID -DMAC -REMOVE LINES, PROBLEMATIC and UNUSED -SLPB -DARWIN / WINDOWS 2015 -XHCI -PLUGIN TYPE -HDAS to HDEF -HDEF -REAL TIME CLOCK -ARTC -IRQs -SBUS -BUS1 -MCHC -ALS0 -SHUTDOWN -FWHD -USBX -PMCR -PPMC -XSPI -GMM -IMEI -EC -PRWs -_DSMs -PNLF -BRIGHTNESS KEYS -I2C -NATIVE USB -ARPT -GFX0 -DTGP -ACQUIRE MUT0 0XFFFF -OPERATION REGION GPIO -MUTEX MUT0 0x00 -EXTERNAL REFERENCES -UNKNOWNOBJ -FULL RENAMED DEVICES   --IGPU Patch-- (All credits to Austere.J) Discussion about that HERE
       
      <key>PciRoot(0x0)/Pci(0x2,0x0)</key>             <dict>                 <key>AAPL,ig-platform-id</key>                 <data>AABSig==</data>                 <key>device-id</key>                 <data>UooAAA==</data>                 <key>framebuffer-fbmem</key>                 <data>AACQAA==</data>                 <key>framebuffer-patch-enable</key>                 <data>AQAAAA==</data>                 <key>framebuffer-stolenmem</key>                 <data>AAAwAQ==</data>                 <key>framebuffer-unifiedmem</key>                 <data>AAAAgA==</data>                 <key>hda-gfx</key>                 <string>onboard-1</string>                 <key>igfxfw</key>                 <data>AgAAAA==</data>             </dict>  
      --USB Fix-- https://tinyurl.com/y4mqfahz
       
      -ScreenShots

       


























      -Credits and thanks to the old and new people in the community who developed patches, kexts and bootloaders!   Slice, Kabyl, usr-sse2, jadran, Blackosx, dmazar, STLVNUB, pcj, apianti, JrCs, pene, FrodoKenny, skoczy, ycr.ru, Oscar09, xsmile, SoThOr, RehabMan, Download-Fritz, Zenit432, cecekpawon, Intel, Apple, Oracle, Chameleon Team, crazybirdy, Mieze, Mirone, Oldnapalm, netkas, Elconiglio, artut-pt, ErmaC, Pavo, Toleda, Master Chief and family, bcc9, The King, PMheart, Sherlocks, Micky1979, vit9696, vandroiy2013, Voodoo Team, Pike R. Alpha, lvs1974, Austere.J, CVad, Sampath007, onemanosx, erroruser, Jenny David, Acidanthera Team, Olarila Facebook Community, Hackintosh Facebook Community and many others!     We're all here to have fun and learn from each other!
×