Jump to content
Welcome to InsanelyMac Forum

Register now to gain access to all of our features. Once registered and logged in, you will be able to contribute to this site by submitting your own content or replying to existing content. You'll be able to customize your profile, receive reputation points as a reward for submitting content, while also communicating with other members via your own private inbox, plus much more! This message will be removed once you have signed in.

alexanderq

Members
  • Content count

    321
  • Joined

  • Last visited

About alexanderq

  • Rank
    InsanelyMac Sage

Profile Information

  • Gender
    Male
  1. Hello i have this error any solution? Building ... /Users/alex/src/edk2/MdeModulePkg/Universal/DisplayEngineDxe/DisplayEngineDxe.inf [X64] In file included from /Users/alex/src/edk2/MdeModulePkg/Universal/DisplayEngineDxe/FormDisplay.c:16: In file included from /Users/alex/src/edk2/MdeModulePkg/Universal/DisplayEngineDxe/FormDisplay.h:31: /Users/alex/src/edk2/MdePkg/Include/Protocol/HiiPopup.h:76:3: error: redefinition of typedef 'EFI_HII_POPUP_PROTOCOL' is a C11 feature [-Werror,-Wtypedef-redefinition] } EFI_HII_POPUP_PROTOCOL; ^ /Users/alex/src/edk2/MdePkg/Include/Protocol/HiiPopup.h:24:40: note: previous definition is here typedef struct _EFI_HII_POPUP_PROTOCOL EFI_HII_POPUP_PROTOCOL; ^ 1 error generated. make: *** [/users/alex/src/edk2/Build/Clover/RELEASE_XCODE5/X64/MdeModulePkg/Universal/DisplayEngineDxe/DisplayEngineDxe/OUTPUT/FormDisplay.obj] Error 1 build.py... : error 7000: Failed to execute command make tbuild [/users/alex/src/edk2/Build/Clover/RELEASE_XCODE5/X64/MdeModulePkg/Universal/DisplayEngineDxe/DisplayEngineDxe] build.py... : error F002: Failed to build module /Users/alex/src/edk2/MdeModulePkg/Universal/DisplayEngineDxe/DisplayEngineDxe.inf [X64, XCODE5, RELEASE] - Failed - Build end time: 21:09:45, Oct.22 2017 Build total time: 00:00:58 o_Ops, ./ebuild.sh exited with error(s), aborting.. logout [Process completed]
  2. Clover General discussion

    Fakeid does not work for me DarwinDumper_3.0.2_28.11_20.42.34_MacBookPro5,1_Clover_X64_3948_Mavericks_13F1911_alex.zip
  3. Clover General discussion

    After using for long time version 3684 today i updated to 3948 and my wirelles card stoped working.I tried older version untill 3811 but none of them worked. DarwinDumper_3.0.2_27.11_18.30.28_MacBookPro5,1_Clover_X64_3684_Mavericks_13E28_alex.zipDarwinDumper_3.0.2_27.11_22.10.10_MacBookPro5,1_Clover_X64_3948_Mavericks_13E28_alex.zip
  4. I understand your point thank you for the answer and here it fits exactly the answer of a question. How to go straight;You can go in circles.Or how to go to the moon;After you pass Jupiter turn right to Mars and you will find it after MacDonald.Just joking thank you for your work.
  5. Sorry to ask but why separate options;There is already a developer mode.
  6. System Software Overview: System Version: OS X 10.10.5 (14F1912) Kernel Version: Darwin 14.5.0 Time since boot: 11 minutes
  7. Some help please as i tried many times with fresh build by deleting src folder but always i get this error [XCODE] ================= Making all in fdisk440 ================= [MKDIR] /Users/alex/src/edk2/Clover/CloverPackage/sym/build/fdisk440 [CC32] auto.c [CC32] cmd.c [CC32] disk.c [CC32] fdisk.c [CC32] getrawpartition.c [CC32] mbr.c [CC32] misc.c [CC32] opendev.c [CC32] part.c [CC32] user.c [CC64] auto.c [CC64] cmd.c [CC64] disk.c [CC64] fdisk.c [CC64] getrawpartition.c [CC64] mbr.c [CC64] misc.c [CC64] opendev.c [CC64] part.c [CC64] user.c [LD32] fdisk440_32 ld: library not found for -lgcc_s.10.5 clang: error: linker command failed with exit code 1 (use -v to see invocation) make[2]: *** [/users/alex/src/edk2/Clover/CloverPackage/sym/utils/fdisk440] Error 1 make[1]: *** [all-recursive] Error 1 make: *** [pkg] Error 2 =============================================================================== build started at: Fri Oct 14 22:14:25 EEST 2016 finished at Fri Oct 14 22:17:44 EEST 2016 Done! <---------------------------------------------------- logout [Process completed]
  8. Clover on AMD X64 Exception Type Error

    It is weird that are so many hackintosh with AMD cpu and nobody found a solution.
  9. Clover General discussion

    https://clover-wiki.zetam.org/Configuration/SMBIOS#smbios_productname
  10. Clover on AMD X64 Exception Type Error

    Apple do not use AMD processors so there is no support. :lol: :lol:
  11. Clover on real mac

    The important thing is not how good Clover can inject mac properties but how good can emulate hackintosh to a real mac.
  12. Clover General discussion

    I confirm that and it happens with latest version 3566.
  13. Apple unveils "macOS Sierra"

    Build latest Clover and it will work.
  14. El Capitan, Can not get mouse to work in Installer

    Can you tell me how did you manage to boot Clover on amd as it says here http://www.insanelymac.com/forum/topic/311941-amd-el-capitan-slice/ and me it does not boot at all.
×