Jump to content

artur_pt

Moderators
  • Content Count

    6,615
  • Joined

  • Last visited

  • Days Won

    24

Everything posted by artur_pt

  1. artur_pt

    Clover.app testing

    hello the app in Portuguese translation is good , nice work vector sigma good hack
  2. artur_pt

    Clover.app testing

    hello vector sigma Portuguese translation pt_PT.strings.zip thanks
  3. olá dev preview de 10.15 Catalina Tudo muito novo para dizer alguma coisa .. bom hack
  4. artur_pt

    macOS Catalina (10.15) versões beta

    olá 1º dev beta de 10.15.2 bom hack
  5. olá saiu a versão final de 10.15.1 update sem problemas, Clover release 5098 bom hack
  6. artur_pt

    macOS 10.15.1 build (19B88)

    olá só a versão 0.3 que funciona no meu note as outras testei mas sempre com KP na injeção das kext mas ainda está muito cru OC, e bastante complicado na config, penso que a abordagem está mal na configuração dev estão a dar pouco suporte na explicação de como funciona o config e sempre a alterar coisas. 1 abraço e bom verão para vcs por ai
  7. hello nice " gato " should be looked by NASA good hack
  8. artur_pt

    Problema no driver de vídeo.

    olá já tentaste isto uns dizem que funciona .. https://devtalk.nvidia.com/default/topic/1025945/mac-cuda-driver-fully-compatible-with-macos-high-sierra-10-13-error-/?offset=233 tens de procurar nos forum da apple support
  9. artur_pt

    macOS Catalina (10.15) versões beta

    olá Catalina beta dev 3 de 10.15.1 bom hack
  10. artur_pt

    macOS Catalina (10.15) versões beta

    olá Catalina dev beta 2 de 10.15.1 bom hack
  11. hello catwoman as usual great work all is working in my notebook thanks
  12. artur_pt

    Catalina 10.15(15A983) Disable SIP

    hello sorry dont understand what u are talking about anyway thanks for ur time
  13. artur_pt

    Catalina 10.15(15A983) Disable SIP

    artur_pt@MBP-de-artur-pt ~ % sudo mount -uw / Password: mount_apfs: volume could not be mounted: Operation not permitted mount: / failed with 77 thanks
  14. artur_pt

    macOS Catalina (10.15) versões beta

    olá bem vindo o bicho continua no sangue ... ahahah
  15. artur_pt

    Clover General discussion

    hello no issues now with last commits build 5094 using it now thanks
  16. artur_pt

    Clover General discussion

    hello Slice last commit in git give me this thanks
  17. artur_pt

    macOS Catalina (10.15) versões beta

    olá Catalina dev beta 11 Final deve estar aí a rebentar bom hack
  18. artur_pt

    macOS Catalina (10.15) versões beta

    olá Catalina beta dev 10 bom hack
  19. artur_pt

    Clover General discussion

    hello Slice sorry not solved ====================================================================== FAIL: test_AutoGen_GenMake (CheckPythonSyntax.Tests) ---------------------------------------------------------------------- Traceback (most recent call last): File "/Users/artur_pt/src/CloverBootloader/BaseTools/Tests/CheckPythonSyntax.py", line 49, in newmethod = lambda self: self.SingleFileTest(filename) File "/Users/artur_pt/src/CloverBootloader/BaseTools/Tests/CheckPythonSyntax.py", line 27, in SingleFileTest self.fail('syntax error: %s, Error is %s' % (filename, str(e))) AssertionError: syntax error: /Users/artur_pt/src/CloverBootloader/BaseTools/Source/Python/AutoGen/GenMake.py, Error is Sorry: IndentationError: unexpected indent (GenMake.py, line 1247) ---------------------------------------------------------------------- Ran 280 tests in 2.342s FAILED (failures=1) Running edk2 build for CloverX64 using the command: build --conf=/Users/artur_pt/src/CloverBootloader/Conf -D USE_LOW_EBDA -p Clover.dsc -a X64 -b RELEASE -t XCODE8 -n 5 Traceback (most recent call last): File "/Users/artur_pt/src/CloverBootloader/BaseTools/BinWrappers/PosixLike/../../Source/Python/build/build.py", line 30, in from AutoGen.PlatformAutoGen import PlatformAutoGen File "/Users/artur_pt/src/CloverBootloader/BaseTools/Source/Python/AutoGen/PlatformAutoGen.py", line 18, in from . import GenMake File "/Users/artur_pt/src/CloverBootloader/BaseTools/Source/Python/AutoGen/GenMake.py", line 1247 self.DependencyHeaderFileSet = set() ^ IndentationError: unexpected indent thanks
  20. artur_pt

    Clover General discussion

    hello not here gettext 0.20.1 error compiling Catalina last beta with Xcode 11 anyway if I use opt folder from Mojave, works good thanks
  21. artur_pt

    Clover General discussion

    hello sorry not solved thanks
  22. artur_pt

    Clover General discussion

    hello i set to buildme xcode8 thanks
  23. artur_pt

    Clover General discussion

    hello with new Xcode 11 buildme is giving me this error compiling gettext gettext.make.log.txt.zip thanks
  24. artur_pt

    Clover General discussion

    hello to all clover dev why in git we have a clover rev version Dif from the source forge ? thanks
  25. artur_pt

    Clover General discussion

    hello new update for Catalina last dev in platform.c thanks to all dev
×