Jump to content

D-an-W

Members
  • Content Count

    802
  • Joined

  • Last visited

File Comments posted by D-an-W


  1. Currently unable to build latest Clover version, also tried deleting the /src folder but still fails.

    ============================= Make Clover Package =============================
    
    rm -rf sym obj dst
    
    ========= Translating Resources ========
    /Users/Dan/src/edk2/Clover/CloverPackage/package/../../../../opt/local
    Updating 'en' strings file for CloverUpdater... done
    Updating 'en' strings file for Clover Preference Panel... done
    Updating strings file for Clover Preference Panel... done
     (204 entries)
    Discard ../sym/Resources/Clover/Resources/sv.lproj/Welcome.html (0 of 10 strings; only 0% translated; need 80%).
    Discard ../sym/Resources/Clover/Resources/sv.lproj/Description.html (0 of 26 strings; only 0% translated; need 80%).
    Discard ../sym/Resources/Clover/Resources/sv.lproj/Conclusion.html (0 of 4 strings; only 0% translated; need 80%).
    Discard ../sym/Resources/Clover/Resources/sv.lproj/Localizable.strings (0 of 114 strings; only 0% translated; need 74%).
    Discard ../CloverUpdater/src/sv.lproj/CloverUpdater.strings (0 of 12 strings; only 0% translated; need 74%).
    Discard ../CloverPrefpane/src/sv.lproj/CloverPrefpane.strings (0 of 39 strings; only 0% translated; need 74%).
    Discard ../CloverPrefpane/src/sv.lproj/Localizable.strings (0 of 10 strings; only 0% translated; need 74%).
    
    Building CloverUpdater application...
    [XCODE]
    Building CloverPrefpane preference...
    [XCODE]
    ================= Making all in fdisk440 =================
    	[MKDIR] /Users/Dan/src/edk2/Clover/CloverPackage/sym/build/fdisk440
    	[CC32] auto.c
    	[CC32] cmd.c
    	[CC32] disk.c
    	[CC32] fdisk.c
    	[CC32] getrawpartition.c
    	[CC32] mbr.c
    	[CC32] misc.c
    	[CC32] opendev.c
    	[CC32] part.c
    	[CC32] user.c
    	[CC64] auto.c
    	[CC64] cmd.c
    	[CC64] disk.c
    	[CC64] fdisk.c
    	[CC64] getrawpartition.c
    	[CC64] mbr.c
    	[CC64] misc.c
    	[CC64] opendev.c
    	[CC64] part.c
    	[CC64] user.c
    	[LD32] fdisk440_32
    ld: warning: object file (/Users/Dan/src/edk2/Clover/CloverPackage/sym/build/fdisk440/auto.o32) was built for newer OSX version (10.11) than being linked (10.5)
    ld: warning: object file (/Users/Dan/src/edk2/Clover/CloverPackage/sym/build/fdisk440/cmd.o32) was built for newer OSX version (10.11) than being linked (10.5)
    ld: warning: object file (/Users/Dan/src/edk2/Clover/CloverPackage/sym/build/fdisk440/disk.o32) was built for newer OSX version (10.11) than being linked (10.5)
    ld: warning: object file (/Users/Dan/src/edk2/Clover/CloverPackage/sym/build/fdisk440/fdisk.o32) was built for newer OSX version (10.11) than being linked (10.5)
    ld: warning: object file (/Users/Dan/src/edk2/Clover/CloverPackage/sym/build/fdisk440/getrawpartition.o32) was built for newer OSX version (10.11) than being linked (10.5)
    ld: warning: object file (/Users/Dan/src/edk2/Clover/CloverPackage/sym/build/fdisk440/mbr.o32) was built for newer OSX version (10.11) than being linked (10.5)
    ld: warning: object file (/Users/Dan/src/edk2/Clover/CloverPackage/sym/build/fdisk440/misc.o32) was built for newer OSX version (10.11) than being linked (10.5)
    ld: warning: object file (/Users/Dan/src/edk2/Clover/CloverPackage/sym/build/fdisk440/opendev.o32) was built for newer OSX version (10.11) than being linked (10.5)
    ld: warning: object file (/Users/Dan/src/edk2/Clover/CloverPackage/sym/build/fdisk440/part.o32) was built for newer OSX version (10.11) than being linked (10.5)
    ld: warning: object file (/Users/Dan/src/edk2/Clover/CloverPackage/sym/build/fdisk440/user.o32) was built for newer OSX version (10.11) than being linked (10.5)
    	[LD64] fdisk440_64
    ld: warning: object file (/Users/Dan/src/edk2/Clover/CloverPackage/sym/build/fdisk440/auto.o64) was built for newer OSX version (10.11) than being linked (10.5)
    ld: warning: object file (/Users/Dan/src/edk2/Clover/CloverPackage/sym/build/fdisk440/cmd.o64) was built for newer OSX version (10.11) than being linked (10.5)
    ld: warning: object file (/Users/Dan/src/edk2/Clover/CloverPackage/sym/build/fdisk440/fdisk.o64) was built for newer OSX version (10.11) than being linked (10.5)
    ld: warning: object file (/Users/Dan/src/edk2/Clover/CloverPackage/sym/build/fdisk440/getrawpartition.o64) was built for newer OSX version (10.11) than being linked (10.5)
    ld: warning: object file (/Users/Dan/src/edk2/Clover/CloverPackage/sym/build/fdisk440/disk.o64) was built for newer OSX version (10.11) than being linked (10.5)
    ld: warning: object file (/Users/Dan/src/edk2/Clover/CloverPackage/sym/build/fdisk440/mbr.o64) was built for newer OSX version (10.11) than being linked (10.5)
    ld: warning: object file (/Users/Dan/src/edk2/Clover/CloverPackage/sym/build/fdisk440/misc.o64) was built for newer OSX version (10.11) than being linked (10.5)
    ld: warning: object file (/Users/Dan/src/edk2/Clover/CloverPackage/sym/build/fdisk440/opendev.o64) was built for newer OSX version (10.11) than being linked (10.5)
    ld: warning: object file (/Users/Dan/src/edk2/Clover/CloverPackage/sym/build/fdisk440/part.o64) was built for newer OSX version (10.11) than being linked (10.5)
    ld: warning: object file (/Users/Dan/src/edk2/Clover/CloverPackage/sym/build/fdisk440/user.o64) was built for newer OSX version (10.11) than being linked (10.5)
    	[LIPO] /Users/Dan/src/edk2/Clover/CloverPackage/sym/utils/fdisk440
    ================= Making all in boot1-install =================
    	[XCODE] boot1-install
    ================= Making all in partutil =================
    	[XCODE] partutil
    ================= Making all in bdmesg =================
    	[XCODE] bdmesg
    ================= Making all in clover-genconfig =================
    	[XCODE] clover-genconfig
    ** INSTALL FAILED **
    
    
    The following build commands failed:
    	Ld /Users/Dan/src/edk2/Clover/CloverPackage/sym/build/clover-genconfig/clover-genconfig.build/Release/clover-genconfig.build/Objects-normal/x86_64/clover-genconfig normal x86_64
    (1 failure)
    make[2]: *** [/Users/Dan/src/edk2/Clover/CloverPackage/sym/utils/clover-genconfig] Error 65
    make[1]: *** [all-recursive] Error 1
    make: *** [pkg] Error 2
    ================= Making all in fdisk440 =================
    make[2]: Nothing to be done for `all'.
    ================= Making all in boot1-install =================
    make[2]: Nothing to be done for `all'.
    ================= Making all in partutil =================
    make[2]: Nothing to be done for `all'.
    ================= Making all in bdmesg =================
    make[2]: Nothing to be done for `all'.
    ================= Making all in clover-genconfig =================
    	[XCODE] clover-genconfig
    ** INSTALL FAILED **
    
    
    The following build commands failed:
    	Ld /Users/Dan/src/edk2/Clover/CloverPackage/sym/build/clover-genconfig/clover-genconfig.build/Release/clover-genconfig.build/Objects-normal/x86_64/clover-genconfig normal x86_64
    (1 failure)
    make[2]: *** [/Users/Dan/src/edk2/Clover/CloverPackage/sym/utils/clover-genconfig] Error 65
    make[1]: *** [all-recursive] Error 1
    make: *** [utils] Error 2
    
    Complete Build time 19m43s
    
    ============== Finish working: 2016-07-23 06:29:54 +0100 ==================
    
    Syncing disk cache ... Done.
    
    All done.
    Have a nice ... day(night)
    Enjoy ...
    
    

    Any ideas please cvad?


  2. Forget everything I said below, deleted the /src/ folder and tried again. It worked fine first time. I guess I must have had something in there it didn't like.

     

     

    I just downloaded Clover_Builder.app.v1.0.5.zip and it didn't seem to want to work but it could well be me doing something wrong as I didn't edit anything prior to trying it for the first time.

     

    Also, am I right in saying everything is installed in the /src/ folder?

     

     

    This is where things seemed to go wrong...

    ============================= Make Clover Package =============================
    
    rm -rf sym obj dst
    
    ========= Translating Resources ========
    /Users/Dan/src/edk2/Clover/CloverPackage/package/../../../../opt/local
    Updating 'en' strings file for CloverUpdater... done
    Updating 'en' strings file for Clover Preference Panel... done
    Updating strings file for Clover Preference Panel... done
     (202 entries)
    Discard ../sym/Resources/Clover/Resources/sv.lproj/Welcome.html (0 of 10 strings; only 0% translated; need 80%).
    Discard ../sym/Resources/Clover/Resources/sv.lproj/Description.html (0 of 29 strings; only 0% translated; need 80%).
    Discard ../sym/Resources/Clover/Resources/sv.lproj/Conclusion.html (0 of 4 strings; only 0% translated; need 80%).
    Discard ../sym/Resources/Clover/Resources/sv.lproj/Localizable.strings (0 of 114 strings; only 0% translated; need 74%).
    Discard ../CloverUpdater/src/sv.lproj/CloverUpdater.strings (0 of 12 strings; only 0% translated; need 74%).
    Discard ../CloverPrefpane/src/sv.lproj/CloverPrefpane.strings (0 of 39 strings; only 0% translated; need 74%).
    Discard ../CloverPrefpane/src/sv.lproj/Localizable.strings (0 of 10 strings; only 0% translated; need 74%).
    Discard ../sym/Resources/Clover/Resources/tr.lproj/Description.html (22 of 29 strings; only 75.86% translated; need 80%).
    
    Building CloverUpdater application...
    [XCODE]
    Building CloverPrefpane preference...
    [XCODE]
    ================= Making all in fdisk440 =================
    	[MKDIR] /Users/Dan/src/edk2/Clover/CloverPackage/sym/build/fdisk440
    	[CC32] auto.c
    	[CC32] cmd.c
    	[CC32] disk.c
    	[CC32] fdisk.c
    	[CC32] getrawpartition.c
    	[CC32] mbr.c
    	[CC32] misc.c
    	[CC32] opendev.c
    	[CC32] part.c
    	[CC32] user.c
    	[CC64] auto.c
    	[CC64] cmd.c
    	[CC64] disk.c
    	[CC64] fdisk.c
    	[CC64] getrawpartition.c
    	[CC64] mbr.c
    	[CC64] misc.c
    	[CC64] opendev.c
    	[CC64] part.c
    	[CC64] user.c
    	[LD32] fdisk440_32
    ld: warning: object file (/Users/Dan/src/edk2/Clover/CloverPackage/sym/build/fdisk440/auto.o32) was built for newer OSX version (10.11) than being linked (10.5)
    ld: warning: object file (/Users/Dan/src/edk2/Clover/CloverPackage/sym/build/fdisk440/cmd.o32) was built for newer OSX version (10.11) than being linked (10.5)
    ld: warning: object file (/Users/Dan/src/edk2/Clover/CloverPackage/sym/build/fdisk440/disk.o32) was built for newer OSX version (10.11) than being linked (10.5)
    ld: warning: ld: warning: object file (/Users/Dan/src/edk2/Clover/CloverPackage/sym/build/fdisk440/fdisk.o32) was built for newer OSX version (10.11) than being linked (10.5)object file (/Users/Dan/src/edk2/Clover/CloverPackage/sym/build/fdisk440/getrawpartition.o32) was built for newer OSX version (10.11) than being linked (10.5)
    
    ld: warning: object file (/Users/Dan/src/edk2/Clover/CloverPackage/sym/build/fdisk440/mbr.o32) was built for newer OSX version (10.11) than being linked (10.5)
    ld: warning: object file (/Users/Dan/src/edk2/Clover/CloverPackage/sym/build/fdisk440/misc.o32) was built for newer OSX version (10.11) than being linked (10.5)
    ld: warning: object file (/Users/Dan/src/edk2/Clover/CloverPackage/sym/build/fdisk440/opendev.o32) was built for newer OSX version (10.11) than being linked (10.5)
    ld: warning: object file (/Users/Dan/src/edk2/Clover/CloverPackage/sym/build/fdisk440/part.o32) was built for newer OSX version (10.11) than being linked (10.5)
    ld: warning: object file (/Users/Dan/src/edk2/Clover/CloverPackage/sym/build/fdisk440/user.o32) was built for newer OSX version (10.11) than being linked (10.5)
    	[LD64] fdisk440_64
    ld: warning: object file (/Users/Dan/src/edk2/Clover/CloverPackage/sym/build/fdisk440/auto.o64) was built for newer OSX version (10.11) than being linked (10.5)ld: warning: 
    object file (/Users/Dan/src/edk2/Clover/CloverPackage/sym/build/fdisk440/cmd.o64) was built for newer OSX version (10.11) than being linked (10.5)
    ld: warning: object file (/Users/Dan/src/edk2/Clover/CloverPackage/sym/build/fdisk440/fdisk.o64) was built for newer OSX version (10.11) than being linked (10.5)
    ld: warning: object file (/Users/Dan/src/edk2/Clover/CloverPackage/sym/build/fdisk440/getrawpartition.o64) was built for newer OSX version (10.11) than being linked (10.5)
    ld: warning: object file (/Users/Dan/src/edk2/Clover/CloverPackage/sym/build/fdisk440/disk.o64) was built for newer OSX version (10.11) than being linked (10.5)
    ld: warning: object file (/Users/Dan/src/edk2/Clover/CloverPackage/sym/build/fdisk440/mbr.o64) was built for newer OSX version (10.11) than being linked (10.5)
    ld: warning: object file (/Users/Dan/src/edk2/Clover/CloverPackage/sym/build/fdisk440/misc.o64) was built for newer OSX version (10.11) than being linked (10.5)
    ld: warning: object file (/Users/Dan/src/edk2/Clover/CloverPackage/sym/build/fdisk440/opendev.o64) was built for newer OSX version (10.11) than being linked (10.5)
    ld: warning: object file (/Users/Dan/src/edk2/Clover/CloverPackage/sym/build/fdisk440/part.o64) was built for newer OSX version (10.11) than being linked (10.5)
    ld: warning: object file (/Users/Dan/src/edk2/Clover/CloverPackage/sym/build/fdisk440/user.o64) was built for newer OSX version (10.11) than being linked (10.5)
    	[LIPO] /Users/Dan/src/edk2/Clover/CloverPackage/sym/utils/fdisk440
    ================= Making all in boot1-install =================
    	[XCODE] boot1-install
    ================= Making all in partutil =================
    	[XCODE] partutil
    ================= Making all in bdmesg =================
    	[XCODE] bdmesg
    ================= Making all in clover-genconfig =================
    	[XCODE] clover-genconfig
    ** INSTALL FAILED **
    
    
    The following build commands failed:
    	CompileC /Users/Dan/src/edk2/Clover/CloverPackage/sym/build/clover-genconfig/clover-genconfig.build/Release/clover-genconfig.build/Objects-normal/i386/clover-genconfig.o clover-genconfig.c normal i386 c com.apple.compilers.llvm.clang.1_0.compiler
    	CompileC /Users/Dan/src/edk2/Clover/CloverPackage/sym/build/clover-genconfig/clover-genconfig.build/Release/clover-genconfig.build/Objects-normal/x86_64/clover-genconfig.o clover-genconfig.c normal x86_64 c com.apple.compilers.llvm.clang.1_0.compiler
    (2 failures)
    make[2]: *** [/Users/Dan/src/edk2/Clover/CloverPackage/sym/utils/clover-genconfig] Error 65
    make[1]: *** [all-recursive] Error 1
    make: *** [pkg] Error 2
    ================= Making all in fdisk440 =================
    make[2]: Nothing to be done for `all'.
    ================= Making all in boot1-install =================
    make[2]: Nothing to be done for `all'.
    ================= Making all in partutil =================
    make[2]: Nothing to be done for `all'.
    ================= Making all in bdmesg =================
    make[2]: Nothing to be done for `all'.
    ================= Making all in clover-genconfig =================
    	[XCODE] clover-genconfig
    ** INSTALL FAILED **
    
    
    The following build commands failed:
    	CompileC /Users/Dan/src/edk2/Clover/CloverPackage/sym/build/clover-genconfig/clover-genconfig.build/Release/clover-genconfig.build/Objects-normal/x86_64/clover-genconfig.o clover-genconfig.c normal x86_64 c com.apple.compilers.llvm.clang.1_0.compiler
    	CompileC /Users/Dan/src/edk2/Clover/CloverPackage/sym/build/clover-genconfig/clover-genconfig.build/Release/clover-genconfig.build/Objects-normal/i386/clover-genconfig.o clover-genconfig.c normal i386 c com.apple.compilers.llvm.clang.1_0.compiler
    (2 failures)
    make[2]: *** [/Users/Dan/src/edk2/Clover/CloverPackage/sym/utils/clover-genconfig] Error 65
    make[1]: *** [all-recursive] Error 1
    make: *** [utils] Error 2
    
    Complete Build time 2m51s
    
    ============== Finish working: 2016-03-30 17:55:52 +0100 ==================
    
    Syncing disk cache ... Done.
    
    All done.
    Have a nice ... day(night)
    Enjoy ...
    
    
×