Jump to content

stinga11

Members
  • Content count

    339
  • Joined

  • Last visited

  • Days Won

    3

stinga11 last won the day on January 5 2017

stinga11 had the most liked content!

1 Follower

About stinga11

  • Rank
    InsanelyMac Sage

Profile Information

  • Gender
    Male
  • Location
    Puerto Rico
  • Interests
    Music teacher in public schools

Recent Profile Visitors

The recent visitors block is disabled and is not being shown to other users.

  1. I have ready the new patches but I dont have time to create a new post. I will try to upload the next week. Enviado desde mi ONEPLUS A5010 mediante Tapatalk
  2. r4680 is successfully build with 4.9.2 script. Thanks Guys!!!!
  3. Greetings, I downloaded the latest version of "https://github.com/acidanthera/EfiPkg" as the clover does not compile.
  4. with the lastest udpdates on clover I cant compile. ================================================================================ Building Clover <-------------------------------------------------- ================================================================================ boot6 <-------------------------------------------------- TOOLCHAIN_DIR: /Users/exzo/src/opt/local MTOC_PREFIX: /Users/exzo/src/opt/local/bin/ NASM_PREFIX: /Users/exzo/src/opt/local/bin/ NASM_VER: 2.13.03 Building from: /Users/exzo/src/edk2 Running edk2 build for CloverX64 using the command: build -D NO_GRUB_DRIVERS_EMBEDDED --conf=/Users/exzo/src/edk2/Conf -D USE_LOW_EBDA -p Clover/Clover.dsc -a X64 -b RELEASE -t XCODE8 -n 13 Build environment: Darwin-18.0.0-x86_64-i386-64bit Build start time: 16:01:23, Sep.28 2018 WORKSPACE = /Users/exzo/src/edk2 ECP_SOURCE = /Users/exzo/src/edk2/EdkCompatibilityPkg EDK_SOURCE = /Users/exzo/src/edk2/EdkCompatibilityPkg EFI_SOURCE = /Users/exzo/src/edk2/EdkCompatibilityPkg EDK_TOOLS_PATH = /Users/exzo/src/edk2/BaseTools CONF_PATH = /Users/exzo/src/edk2/Conf Architecture(s) = X64 Build target = RELEASE Toolchain = XCODE8 Active Platform = /Users/exzo/src/edk2/Clover/Clover.dsc Flash Image Definition = /Users/exzo/src/edk2/Clover/Clover.fdf Processing meta-data ................ done! Building ... /Users/exzo/src/edk2/MdePkg/Library/BaseIoLibIntrinsic/BaseIoLibIntrinsic.inf [X64] Building ... /Users/exzo/src/edk2/MdePkg/Library/BaseReportStatusCodeLibNull/BaseReportStatusCodeLibNull.inf [X64] make: Nothing to be done for `tbuild'. Building ... /Users/exzo/src/edk2/MdePkg/Library/BasePrintLib/BasePrintLib.inf [X64] Building ... /Users/exzo/src/edk2/MdePkg/Library/BaseLib/BaseLib.inf [X64] make: Nothing to be done for `tbuild'. Building ... /Users/exzo/src/edk2/MdePkg/Library/BaseMemoryLib/BaseMemoryLib.inf [X64] Building ... /Users/exzo/src/edk2/MdePkg/Library/BaseDebugLibNull/BaseDebugLibNull.inf [X64] make: Nothing to be done for `tbuild'. Building ... /Users/exzo/src/edk2/MdePkg/Library/BasePcdLibNull/BasePcdLibNull.inf [X64] make: Nothing to be done for `tbuild'. make: Nothing to be done for `tbuild'. Building ... /Users/exzo/src/edk2/MdePkg/Library/BaseCpuLib/BaseCpuLib.inf [X64] make: Nothing to be done for `tbuild'. Building ... /Users/exzo/src/edk2/Clover/Library/OpensslLib/OpensslLibNull.inf [X64] Building ... /Users/exzo/src/edk2/MdePkg/Library/UefiMemoryLib/UefiMemoryLib.inf [X64] Building ... /Users/exzo/src/edk2/Clover/ShellPkg/Library/UefiShellDebug1CommandsLib/UefiShellDebug1CommandsLib.inf [X64] [CC] BaseReportStatusCodeLib Building ... /Users/exzo/src/edk2/Clover/ShellPkg/Library/UefiShellInstall1CommandsLib/UefiShellInstall1CommandsLib.inf [X64] [SLINK] BaseReportStatusCodeLibNull Building ... /Users/exzo/src/edk2/Clover/ShellPkg/Library/UefiShellDriver1CommandsLib/UefiShellDriver1CommandsLib.inf [X64] Building ... /Users/exzo/src/edk2/Clover/ShellPkg/Library/UefiShellLevel3CommandsLib/UefiShellLevel3CommandsLib.inf [X64] [CC] OpensslLibNull Building ... /Users/exzo/src/edk2/Clover/ShellPkg/Library/UefiShellLevel1CommandsLib/UefiShellLevel1CommandsLib.inf [X64] /Applications/Xcode.app/Contents/Developer/Toolchains/XcodeDefault.xctoolchain/usr/bin/libtool: file: /Users/exzo/src/edk2/Build/Clover/RELEASE_XCODE8/X64/Clover/Library/OpensslLib/OpensslLibNull/OUTPUT/OpensslLibNull.obj has no symbols warning: /Applications/Xcode.app/Contents/Developer/Toolchains/XcodeDefault.xctoolchain/usr/bin/libtool: warning for library: /Users/exzo/src/edk2/Build/Clover/RELEASE_XCODE8/X64/Clover/Library/OpensslLib/OpensslLibNull/OUTPUT/OpensslLib.lib the table of contents is empty (no object file members in the library define global symbols) [SLINK] OpensslLib Building ... /Users/exzo/src/edk2/Clover/ShellPkg/Library/UefiShellLevel2CommandsLib/UefiShellLevel2CommandsLib.inf [X64] Building ... /Users/exzo/src/edk2/MdeModulePkg/Library/DxeNetLib/DxeNetLib.inf [X64] [CC] ScanMem64Wrapper Building ... /Users/exzo/src/edk2/Clover/ShellPkg/Library/UefiShellBcfgCommandLib/UefiShellBcfgCommandLib.inf [X64] [CC] UefiShellInstall1CommandsLib Building ... /Users/exzo/src/edk2/Clover/ShellPkg/Library/UefiShellCommandLib/UefiShellCommandLib.inf [X64] [SLINK] UefiShellInstall1CommandsLib Building ... /Users/exzo/src/edk2/Clover/ShellPkg/Library/UefiHandleParsingLib/UefiHandleParsingLib.inf [X64] Building ... /Users/exzo/src/edk2/MdeModulePkg/Library/UefiHiiServicesLib/UefiHiiServicesLib.inf [X64] Building ... /Users/exzo/src/edk2/Clover/ShellPkg/Library/UefiShellNetwork2CommandsLib/UefiShellNetwork2CommandsLib.inf [X64] [CC] SetSize [CC] ScanMem32Wrapper [CC] Type [CC] UefiShellLevel1CommandsLib [CC] Connect [CC] UefiShellLevel2CommandsLib [CC] SafeString [CC] UefiHiiServicesLib [CC] ScanMem16Wrapper [SLINK] UefiHiiServicesLib Building ... /Users/exzo/src/edk2/Clover/ShellPkg/Library/UefiShellNetwork1CommandsLib/UefiShellNetwork1CommandsLib.inf [X64] [CC] UefiShellNetwork2CommandsLib [CC] Exit [CC] ScanMem8Wrapper [CC] Touch [CC] Devices [CC] Comp [CC] UefiShellNetwork1CommandsLib [CC] Goto [CC] ZeroMemWrapper [CC] Ver [CC] String [CC] TimeDate /Applications/Xcode.app/Contents/Developer/Toolchains/XcodeDefault.xctoolchain/usr/bin/libtool: warning same member name (LongJump.obj) in output file used for input files: /Users/exzo/src/edk2/Build/Clover/RELEASE_XCODE8/X64/MdePkg/Library/BaseLib/BaseLib/OUTPUT/X64/LongJump.obj and: /Users/exzo/src/edk2/Build/Clover/RELEASE_XCODE8/X64/MdePkg/Library/BaseLib/BaseLib/OUTPUT/LongJump.obj (due to use of basename, truncation, blank padding or duplicate input files) /Applications/Xcode.app/Contents/Developer/Toolchains/XcodeDefault.xctoolchain/usr/bin/libtool: warning same member name (SetJump.obj) in output file used for input files: /Users/exzo/src/edk2/Build/Clover/RELEASE_XCODE8/X64/MdePkg/Library/BaseLib/BaseLib/OUTPUT/X64/SetJump.obj and: /Users/exzo/src/edk2/Build/Clover/RELEASE_XCODE8/X64/MdePkg/Library/BaseLib/BaseLib/OUTPUT/SetJump.obj (due to use of basename, truncation, blank padding or duplicate input files) /Applications/Xcode.app/Contents/Developer/Toolchains/XcodeDefault.xctoolchain/usr/bin/libtool: warning same member name (SwitchStack.obj) in output file used for input files: /Users/exzo/src/edk2/Build/Clover/RELEASE_XCODE8/X64/MdePkg/Library/BaseLib/BaseLib/OUTPUT/SwitchStack.obj and: /Users/exzo/src/edk2/Build/Clover/RELEASE_XCODE8/X64/MdePkg/Library/BaseLib/BaseLib/OUTPUT/X64/SwitchStack.obj (due to use of basename, truncation, blank padding or duplicate input files) [CC] CompareMemWrapper [SLINK] BaseLib Building ... /Users/exzo/src/edk2/Clover/ShellPkg/Library/UefiShellLib/UefiShellLib.inf [X64] [CC] OpenInfo [CC] Mode [CC] UefiShellBcfgCommandLib [CC] UefiShellCommandLib [CC] Ping6 [CC] UefiShellLevel3CommandsLib [CC] SetMem64Wrapper [CC] Load /Users/exzo/src/edk2/Clover/ShellPkg/Library/UefiShellLib/UefiShellLib.c:488:1: error: conflicting types for 'ShellOpenFileByDevicePath' ShellOpenFileByDevicePath( ^ /Users/exzo/src/edk2/ShellPkg/Include/Library/ShellLib.h:115:1: note: previous declaration is here ShellOpenFileByDevicePath( ^ [CC] AutoGen /Users/exzo/src/edk2/Clover/ShellPkg/Library/UefiShellLib/UefiShellLib.c:774:39: error: too many arguments to function call, expected 4, have 5 Attributes)); ^~~~~~~~~~ /Users/exzo/src/edk2/ShellPkg/Include/Library/ShellLib.h:113:1: note: 'ShellOpenFileByDevicePath' declared here EFI_STATUS ^ [CC] DxeNetLib [SLINK] UefiShellBcfgCommandLib Building ... /Users/exzo/src/edk2/MdePkg/Library/UefiApplicationEntryPoint/UefiApplicationEntryPoint.inf [X64] 2 errors generated. make: *** [/Users/exzo/src/edk2/Build/Clover/RELEASE_XCODE8/X64/Clover/ShellPkg/Library/UefiShellLib/UefiShellLib/OUTPUT/UefiShellLib.obj] Error 1 [CC] Disconnect build.py... : error 7000: Failed to execute command make tbuild [/Users/exzo/src/edk2/Build/Clover/RELEASE_XCODE8/X64/Clover/ShellPkg/Library/UefiShellLib/UefiShellLib] build.py... : error F002: Failed to build module /Users/exzo/src/edk2/Clover/ShellPkg/Library/UefiShellLib/UefiShellLib.inf [X64, XCODE8, RELEASE] - Failed - Build end time: 16:01:48, Sep.28 2018 Build total time: 00:00:25 o_Ops, ./ebuild.sh exited with error(s), aborting.. can anybody help me?
  5. Thanks I replaced this # ...gettext and mtoc does nothing in Linux because we cannot compile the .pkg if [[ "$SYSNAME" == Darwin ]]; then printHeader "gettext check:" if needGETTEXT && [[ ! -x "${TOOLCHAIN_DIR}"/bin/gettext ]]; then # buildgettext.sh is buggie: # suppose during the download a problem occour you can have an incomplete "gettext-latest.tar.gz" from a previous execution, # but buildgettext.sh think that is already downloaded and will try to decompress this incomplete archive, always failing! # That's why we remove the archive! if [[ -f "${DIR_DOWNLOADS}"/gettext-latest.tar.gz ]]; then rm -f "${DIR_DOWNLOADS}"/gettext-latest.tar.gz; fi "${DIR_MAIN}"/edk2/Clover/buildgettext.sh fi printHeader "mtoc check:" if [[ ! -x "${TOOLCHAIN_DIR}/bin/mtoc.NEW" ]]; then printWarning "mtoc not found, installing...\n" local mtocpath="$DIR_MAIN/edk2/Clover/BuildTools/usr/local/bin" if [[ -f "${mtocpath}/mtoc.NEW.zip" ]]; then unzip -qo "${mtocpath}/mtoc.NEW.zip" -d "${TOOLCHAIN_DIR}/bin/" fi echo "mtoc successfully installed in ${TOOLCHAIN_DIR}/bin." else echo "mtoc found in ${TOOLCHAIN_DIR}/bin." fi if [[ ! -h "${TOOLCHAIN_DIR}/bin/mtoc" ]]; then ln -sf "${TOOLCHAIN_DIR}/bin/mtoc.NEW" "${TOOLCHAIN_DIR}/bin/mtoc" fi export MTOC_PREFIX="${TOOLCHAIN_DIR}/bin/" printThickLine; echo fi to this # ...gettext and mtoc does nothing in Linux because we cannot compile the .pkg if [[ "$SYSNAME" == Darwin ]]; then printHeader "gettext check:" if needGETTEXT && [[ ! -x "${TOOLCHAIN_DIR}"/bin/gettext ]]; then # buildgettext.sh is buggie: # suppose during the download a problem occour you can have an incomplete "gettext-latest.tar.gz" from a previous execution, # but buildgettext.sh think that is already downloaded and will try to decompress this incomplete archive, always failing! # That's why we remove the archive! if [[ -f "${DIR_DOWNLOADS}"/gettext-latest.tar.gz ]]; then rm -f "${DIR_DOWNLOADS}"/gettext-latest.tar.gz; fi "${DIR_MAIN}"/edk2/Clover/buildgettext.sh fi printHeader "mtoc check:" if [[ ! -x "${TOOLCHAIN_DIR}/bin/mtoc.NEW" ]]; then printWarning "mtoc not found, installing...\n" "${DIR_MAIN}"/edk2/Clover/buildmtoc.sh echo "mtoc successfully installed in ${TOOLCHAIN_DIR}/bin." else echo "mtoc found in ${TOOLCHAIN_DIR}/bin." fi export MTOC_PREFIX="${TOOLCHAIN_DIR}/bin/" printThickLine; echo fi and works!!!
  6. Greetings, I have a problem when trying to compile clover I do not know if it is the same one that others are having.
  7. I have the same problem, I have not yet been able to find a solution.
  8. Regards, Your processor is Ivy Bridge-E therefore you do not need the processor patches. Depending on your motherboard you may need the MSR patches.
  9. I had the same problem, but with this version it worked fine.
  10. stinga11

    AptioMemoryFix

    It is possible that the crashes of the final cut are related to the decoding of the video. You should try this: https://github.com/vit9696/Shiki
  11. stinga11

    Clover General discussion

    I will leave a very personal opinion. I think that when someone donates money it is because they want, not because someone they ask for it. A few years ago I found the way to install Yosemite in the Haswell-E eight cores something that nobody could do at that time. Many people donated me money, money that I did not ask for. But they felt that they had to do it for my work. I am not an important person in this forum but I think donations come from the person so with the yellow button of donations is enough.
  12. stinga11

    Clover General discussion

    Regards, I can confirm that the ApatioFixDrv3 and AptioMemoryFix works with native NVRAM. I tested the NVRAM was working with (sudo nvram test = "value") then I restarted and verified with (sudo nvram -p) and it was working perfect. but <key>NvidiaWeb</key> <true/> doesnt works. To have the Nvidia web driver working I need to use the <key>Arguments</key> <string>nvda_drv=1</string>
  13. stinga11

    Clover General discussion

    Regards, Thank you for all the hard work you do. Guys can could explain the differences between the new options for the benefit of all, please. 1.AptioInputFix 2.AptioMemoryFix 3.OsxAptioFixDrv(1)(2)(3)
×