Jump to content

regs1980

Members
  • Content count

    21
  • Joined

  • Last visited

About regs1980

  • Rank
    InsanelyMac Protégé

Profile Information

  • Gender
    Male
  • Location
    German

Recent Profile Visitors

1,970 profile views
  1. regs1980

    Clover problems report & features request

    r4729 little problem
  2. edk2 update is current where is the problem
  3. the same problem my enviroment 10.11.6, xcode8.1
  4. regs1980

    SAPPHIRE RX460 NITRO with SIERRA beta...

    My Card
  5. regs1980

    SAPPHIRE RX460 NITRO with SIERRA beta...

    radeon RX 460 2 GB at normal Mode black screen in safe Mode no black screen
  6. regs1980

    Clover Themes

  7. regs1980

    Clover Themes

    Sierra icon update for Classic Mac OS themes please.
  8. regs1980

    AppleHDA Patcher

    aDummyHDA.kext works in S\L\E dont work's in EFI\Clover\kext\10.11 why not
  9. regs1980

    AppleHDA Patcher

    my config.plist+aDummyHDA https://www.dropbox.com/s/mh66kl9kidzdyu9/ALC898.zip?dl=0
  10. regs1980

    AppleHDA Patcher

    aDummyHDA.kext + config.plist not work for Realtek ALC898
  11. regs1980

    Clover Builder.app

    Works Thanks
  12. regs1980

    Clover Builder.app

    ============================= Make Clover Package ============================= rm -rf sym obj dst ========= Translating Resources ======== /Users/bob/src/edk2/Clover/CloverPackage/package/../../../../opt/local Updating 'en' strings file for CloverUpdater... done Updating 'en' strings file for Clover Preference Panel... done Updating strings file for Clover Preference Panel... done (202 entries) Discard ../sym/Resources/Clover/Resources/sv.lproj/Welcome.html (0 of 10 strings; only 0% translated; need 80%). Discard ../sym/Resources/Clover/Resources/sv.lproj/Description.html (0 of 29 strings; only 0% translated; need 80%). Discard ../sym/Resources/Clover/Resources/sv.lproj/Conclusion.html (0 of 4 strings; only 0% translated; need 80%). Discard ../sym/Resources/Clover/Resources/sv.lproj/Localizable.strings (0 of 114 strings; only 0% translated; need 74%). Discard ../CloverUpdater/src/sv.lproj/CloverUpdater.strings (0 of 12 strings; only 0% translated; need 74%). Discard ../CloverPrefpane/src/sv.lproj/CloverPrefpane.strings (0 of 39 strings; only 0% translated; need 74%). Discard ../CloverPrefpane/src/sv.lproj/Localizable.strings (0 of 10 strings; only 0% translated; need 74%). Discard ../sym/Resources/Clover/Resources/tr.lproj/Description.html (22 of 29 strings; only 75.86% translated; need 80%). Building CloverUpdater application... 2016-03-29 16:06:12.531 xcodebuild[23074:679651] Failed to locate a valid instance of CoreSimulatorService in the bootstrap. Adding it now. [XCODE] Building CloverPrefpane preference... [XCODE] ================= Making all in fdisk440 ================= [MKDIR] /Users/bob/src/edk2/Clover/CloverPackage/sym/build/fdisk440 [CC32] auto.c [CC32] cmd.c [CC32] disk.c [CC32] fdisk.c [CC32] getrawpartition.c [CC32] mbr.c [CC32] misc.c [CC32] opendev.c [CC32] part.c [CC32] user.c [CC64] auto.c [CC64] cmd.c [CC64] disk.c [CC64] fdisk.c [CC64] getrawpartition.c [CC64] mbr.c [CC64] misc.c [CC64] opendev.c [CC64] part.c [CC64] user.c [LD32] fdisk440_32 ld: warning: object file (/Users/bob/src/edk2/Clover/CloverPackage/sym/build/fdisk440/auto.o32) was built for newer OSX version (10.11) than being linked (10.5) ld: warning: object file (/Users/bob/src/edk2/Clover/CloverPackage/sym/build/fdisk440/cmd.o32) was built for newer OSX version (10.11) than being linked (10.5) ld: warning: object file (/Users/bob/src/edk2/Clover/CloverPackage/sym/build/fdisk440/disk.o32) was built for newer OSX version (10.11) than being linked (10.5) ld: warning: object file (/Users/bob/src/edk2/Clover/CloverPackage/sym/build/fdisk440/fdisk.o32) was built for newer OSX version (10.11) than being linked (10.5) ld: warning: object file (/Users/bob/src/edk2/Clover/CloverPackage/sym/build/fdisk440/getrawpartition.o32) was built for newer OSX version (10.11) than being linked (10.5)ld: warning: object file (/Users/bob/src/edk2/Clover/CloverPackage/sym/build/fdisk440/mbr.o32) was built for newer OSX version (10.11) than being linked (10.5)ld: warning: object file (/Users/bob/src/edk2/Clover/CloverPackage/sym/build/fdisk440/misc.o32) was built for newer OSX version (10.11) than being linked (10.5)ld: warning: object file (/Users/bob/src/edk2/Clover/CloverPackage/sym/build/fdisk440/opendev.o32) was built for newer OSX version (10.11) than being linked (10.5) ld: warning: object file (/Users/bob/src/edk2/Clover/CloverPackage/sym/build/fdisk440/part.o32) was built for newer OSX version (10.11) than being linked (10.5)ld: warning: object file (/Users/bob/src/edk2/Clover/CloverPackage/sym/build/fdisk440/user.o32) was built for newer OSX version (10.11) than being linked (10.5) [LD64] fdisk440_64 ld: warning: object file (/Users/bob/src/edk2/Clover/CloverPackage/sym/build/fdisk440/auto.o64) was built for newer OSX version (10.11) than being linked (10.5)ld: warning: object file (/Users/bob/src/edk2/Clover/CloverPackage/sym/build/fdisk440/cmd.o64) was built for newer OSX version (10.11) than being linked (10.5) ld: warning: ld: warning: object file (/Users/bob/src/edk2/Clover/CloverPackage/sym/build/fdisk440/fdisk.o64) was built for newer OSX version (10.11) than being linked (10.5)object file (/Users/bob/src/edk2/Clover/CloverPackage/sym/build/fdisk440/disk.o64) was built for newer OSX version (10.11) than being linked (10.5) ld: warning: object file (/Users/bob/src/edk2/Clover/CloverPackage/sym/build/fdisk440/getrawpartition.o64) was built for newer OSX version (10.11) than being linked (10.5) ld: warning: object file (/Users/bob/src/edk2/Clover/CloverPackage/sym/build/fdisk440/misc.o64) was built for newer OSX version (10.11) than being linked (10.5) ld: warning: ld: warning: object file (/Users/bob/src/edk2/Clover/CloverPackage/sym/build/fdisk440/mbr.o64) was built for newer OSX version (10.11) than being linked (10.5)ld: warning: object file (/Users/bob/src/edk2/Clover/CloverPackage/sym/build/fdisk440/opendev.o64) was built for newer OSX version (10.11) than being linked (10.5) object file (/Users/bob/src/edk2/Clover/CloverPackage/sym/build/fdisk440/part.o64) was built for newer OSX version (10.11) than being linked (10.5)ld: warning: object file (/Users/bob/src/edk2/Clover/CloverPackage/sym/build/fdisk440/user.o64) was built for newer OSX version (10.11) than being linked (10.5) [LIPO] /Users/bob/src/edk2/Clover/CloverPackage/sym/utils/fdisk440 ================= Making all in boot1-install ================= [XCODE] boot1-install ================= Making all in partutil ================= [XCODE] partutil ================= Making all in bdmesg ================= [XCODE] bdmesg ================= Making all in clover-genconfig ================= [XCODE] clover-genconfig ** INSTALL FAILED ** The following build commands failed: CompileC /Users/bob/src/edk2/Clover/CloverPackage/sym/build/clover-genconfig/clover-genconfig.build/Release/clover-genconfig.build/Objects-normal/x86_64/clover-genconfig.o clover-genconfig.c normal x86_64 c com.apple.compilers.llvm.clang.1_0.compiler CompileC /Users/bob/src/edk2/Clover/CloverPackage/sym/build/clover-genconfig/clover-genconfig.build/Release/clover-genconfig.build/Objects-normal/i386/clover-genconfig.o clover-genconfig.c normal i386 c com.apple.compilers.llvm.clang.1_0.compiler (2 failures) make[2]: *** [/Users/bob/src/edk2/Clover/CloverPackage/sym/utils/clover-genconfig] Error 65 make[1]: *** [all-recursive] Error 1 make: *** [pkg] Error 2 ================= Making all in fdisk440 ================= make[2]: Nothing to be done for `all'. ================= Making all in boot1-install ================= make[2]: Nothing to be done for `all'. ================= Making all in partutil ================= make[2]: Nothing to be done for `all'. ================= Making all in bdmesg ================= make[2]: Nothing to be done for `all'. ================= Making all in clover-genconfig ================= [XCODE] clover-genconfig ** INSTALL FAILED ** The following build commands failed: CompileC /Users/bob/src/edk2/Clover/CloverPackage/sym/build/clover-genconfig/clover-genconfig.build/Release/clover-genconfig.build/Objects-normal/x86_64/clover-genconfig.o clover-genconfig.c normal x86_64 c com.apple.compilers.llvm.clang.1_0.compiler CompileC /Users/bob/src/edk2/Clover/CloverPackage/sym/build/clover-genconfig/clover-genconfig.build/Release/clover-genconfig.build/Objects-normal/i386/clover-genconfig.o clover-genconfig.c normal i386 c com.apple.compilers.llvm.clang.1_0.compiler (2 failures) make[2]: *** [/Users/bob/src/edk2/Clover/CloverPackage/sym/utils/clover-genconfig] Error 65 make[1]: *** [all-recursive] Error 1 make: *** [utils] Error 2 Complete Build time 18m9s ============== Finish working: 2016-03-29 16:06:25 +0200 ================== Syncing disk cache ... Done. All done. Have a nice ... day(night) Enjoy ... Xcode is installed
  13. regs1980

    Ozmosis

    Works in the new Ozmosis version Fusion Drive and Sleep mode correctly, or back half and the Fans turn at max.
  14. regs1980

    Ozmosis

    Your small Ozmosis 1479 Bios with DSDT, ALC892 Sound on Mavericks MB 6.1 with HDAEnabler and Yosemite MB 7.2 with HDAEnabler |003|Ozmosis |AAE65279-0761-41D1-BA13-4A3C1383603F|006E3800|02FC91|DRVR| |004|EnhancedFat |961578FE-B6B7-44C3-AF35-6BC705CD2B1F|00713498|00343A|DRVR| |005|HfsPlus |4CF484CD-135F-4FDC-BAFB-1AA104B48D36|007168D8|003712|DRVR| |006|PartitionDxe |1FA1F39E-FEFF-4AAE-BD7B-38A070A3B609|00719FF0|0018C4|DRVR| |007|SmcEmulatorKext|DADE1001-1B31-4FE4-8557-26FCEFC78275|0071B8B8|011474|FRFM| |008|OzmosisDefaults|99F2839C-57C3-411E-ABC3-ADE5267D960D|0072CD30|0002ED|FRFM| H87M-D3H-F10-ozm1479.zip
×