Jump to content
Welcome to InsanelyMac Forum

Register now to gain access to all of our features. Once registered and logged in, you will be able to contribute to this site by submitting your own content or replying to existing content. You'll be able to customize your profile, receive reputation points as a reward for submitting content, while also communicating with other members via your own private inbox, plus much more! This message will be removed once you have signed in.


  • Content count

  • Joined

  • Last visited

About N3N4D

  • Rank
    InsanelyMac Protégé
  1. If anyone have some time please let it compile for me. This is my DTD: 9A 29 A0 D0 51 84 22 30 50 98 36 00 98 FF 10 00 00 1C I'm really need correct Resolution.dylib file. That is for 1440x900x32 resolution. I'm always get the same error while compiling chameleon with your Resolution files, whatever I do. So please, I will appreciate your time to spare on me.
  2. I'm tried with unmodified version of Resolutions and it gave me exact the same error like with the modified for my specific DTD. Then I'm tried RemC's 915Resolution.c and h, the same error occurs. And his Resolution.dylib won't work for me. Correct me if I'm wrong, but Resolution.dylib file needs to go here: MyHDD/Extra/Modules/Resolutin.dylib And change MyHDD/Extra/org.chameleon.Boot.plist
  3. Hello everyone! I have a problem. I'm using your Resolution folder with my DTD for desktop PC, ASUS 19" monitor to get 1440x900x32. I have intel i3 540 1st generation Clarkdale (Ironlake) with intel HD graphics. But when compile chameleon with 915resolution.c for my DTD I'm stuck with an error and don't get a Resolution.dylib file. Here is the few last line of compile output: ================= Making all in Resolution ================= [MKDIR] /Users/cobra/Desktop/chameleon-imod/trunk/obj/i386/modules/Resolution [CC] Resolution.c [CC] edid.c [CC] 915resolution.c 915resolution.c:279:17: error: variable 'type' is used uninitialized whenever 'for' loop exits because its condition is false [-Werror,-Wsometimes-uninitialized] ...for (i = 0; i < sizeof(buses)/sizeof(buses[0]); i++) ^~~~~~~~~~~~~~~~~~~~~~~~~~~~~~~~~~ 915resolution.c:295:9: note: uninitialized use occurs here if (type != CT_UNKNOWN) { ^~~~ 915resolution.c:279:17: note: remove the condition if it is always true ...for (i = 0; i < sizeof(buses)/sizeof(buses[0]); i++) ^~~~~~~~~~~~~~~~~~~~~~~~~~~~~~~~~~ 915resolution.c:132:2: note: variable 'type' is declared here chipset_type type; ^ 1 error generated. make[4]: *** [/users/cobra/Desktop/chameleon-imod/trunk/obj/i386/modules/Resolution/915resolution.o] Error 1 make[3]: *** [all-recursive] Error 1 make[2]: *** [all-recursive] Error 1 make[1]: *** [all-recursive] Error 1 make: *** [all] Error 2