Jump to content

SavageAUS

Donators
  • Content Count

    2,240
  • Joined

  • Last visited

  • Days Won

    4

SavageAUS last won the day on December 17 2018

SavageAUS had the most liked content!

1 Follower

About SavageAUS

  • Rank
    InsanelyMac Deity

Profile Information

  • Gender
    Male

Recent Profile Visitors

6,871 profile views
  1. Is this error going to be fixed in script? Status: gettext-latest.tar.xz not found. % Total % Received % Xferd Average Speed Time Time Time Current Dload Upload Total Spent Left Speed 0 0 0 0 0 0 0 0 --:--:-- 0:00:01 --:--:-- 0 curl: (22) The requested URL returned error: 404 Not Found
  2. SavageAUS

    Combining DSDT + SSDT's

    Also where can I find the source of all of your patches? Sent from my iPhone using Tapatalk
  3. SavageAUS

    Combining DSDT + SSDT's

    Thank you kind sir. Everything seems to work except iGPU idles at 0.55 instead of 0.20. And brightness doesn't work, i have the slider but brightness wont change. Processor Graphics Processor Graphics ‡ Intel® HD Graphics 4400 Graphics Base Frequency 200 MHz Graphics Max Dynamic Frequency 1.10 GHz Graphics Video Max Memory 2 GB Graphics Output eDP/DP/HDMI/VGA Max Resolution (HDMI 1.4)‡ 3200x2000@60Hz Max Resolution (DP)‡ 3200x2000@60Hz Max Resolution (VGA)‡ N/A DirectX* Support 11.2/12 OpenGL* Support 4.3 Intel® Quick Sync Video Yes Intel® InTru™ 3D Technology Yes Intel® Flexible Display Interface (Intel® FDI) Yes Intel® Clear Video HD Technology Yes # of Displays Supported ‡ 3 Device ID 0xA16 Attached new files for checking. Send me MacBook-Pro.zip
  4. SavageAUS

    Combining DSDT + SSDT's

    Thanks MaLdOn I’ll give that a try later. Is that dsdt patched at all or just combined with ssdt’s? Sent from my iPhone using Tapatalk Thanks MaLdOn I’ll give that a try later. Is that dsdt patched at all or just combined with ssdt’s? Sent from my iPhone using Tapatalk
  5. SavageAUS

    Combining DSDT + SSDT's

    Hi all, I am not sure if this is covered elsewhere, i did search but unable to find anything like i want. What i would like to do is combine my dsdt and my ssdt's into one file (DSDT.aml). I am capable of doing the patching for my specific laptop but combining the files is a bit beyond me. I have attached the zip from runme.app and my native .aml and .dsl files without edits. If needed i can do the specific patching first then upload the patched files for combining if this is even possible to be done. origin.zip Send me MacBook-Pro.zip
  6. SavageAUS

    OpenCore Configurator

    I know it's early stages but have you managed to get conversion from Clover config to OC config?
  7. SavageAUS

    USB Wireless TL-WN821N V6

    Which version? Sent from my iPhone using Tapatalk
  8. SavageAUS

    Hackintool v2.5.3

    Any reason for the unknown?
  9. SavageAUS

    Clover problems report & features request

    Build error ================================================================================ Build_Clover script v4.9.7 No update available. <-------------------------------------------------- ================================================================================ By Micky1979 based on Slice, apianti, vit9696, Download Fritz, Zenith432, STLVNUB, JrCs,cecekpawon, Needy, cvad, Rehabman, philip_petev, ErmaC Supported OSes: macOS X, Ubuntu (16.04/16.10), Debian Jessie and Stretch <-------------------------------------------------- CLOVER Remote revision: 4890 Local revision: 4890 EDK2 Remote revision: 28963 Local revision: 28892 The current local EDK2 revision is the suggested one (28892). Used settings: /Users/shane/BuildCloverConfig.txt <-------------------------------------------------- Please enter your choice: 1) update Clover only (no building) 2) update Clover + force edk2 update (no building) 3) run my script on the source 4) build existing revision (no update, for testing only) 5) build existing revision for release (no update, standard build) 6) build existing revision with custom macros enabled 7) enter Developers mode (only for devs) 8) Try Clover Configurator Pro.app 9) edit the configuration file 10) Exit ? 5 ================================================================================ Select the desired architecture <-------------------------------------------------- 1) Standard x64 only 2) ia32 and x64 (ia32 is deprecated) 3) ia32 only (deprecated) 4) Back to Main Menu 5) Exit ? 1 ================================================================================ Select the desired pkg type <-------------------------------------------------- 1) Standard 2) slim pkg that skip themes and CloverThemeManager.app 3) slim pkg that skip themes and CloverThemeManager.app, updater and PrefPanel 4) slim pkg UEFI only, without RC Scripts, themes & CTM, updater and PrefPanel 5) Back to Select architecture menu 6) Exit ? 1 ================================================================================ Running from: macOS 10.14.4 Xcode 10.1 Build version 10B61 <-------------------------------------------------- ================================================================================ Compiler settings <-------------------------------------------------- Configured with: --prefix=/Applications/Xcode.app/Contents/Developer/usr --with-gxx-include-dir=/Applications/Xcode.app/Contents/Developer/Platforms/MacOSX.platform/Developer/SDKs/MacOSX10.14.sdk/usr/include/c++/4.2.1 Apple LLVM version 10.0.0 (clang-1000.11.45.5) Target: x86_64-apple-darwin18.5.0 Thread model: posix InstalledDir: /Applications/Xcode.app/Contents/Developer/Toolchains/XcodeDefault.xctoolchain/usr/bin <-------------------------------------------------- ================================================================================ BUILDTOOL is XCODE8 <-------------------------------------------------- ================================================================================ nasm check: <-------------------------------------------------- NASM version 2.13.03 compiled on Feb 7 2018 ================================================================================ gettext check: <-------------------------------------------------- found gettext at /Users/shane/src/opt/local/bin ================================================================================ mtoc check: <-------------------------------------------------- mtoc found in /Users/shane/src/opt/local/bin. ================================================================================ Loading previous configuration from /Users/shane/src/edk2/Conf/BuildEnv.sh WORKSPACE: /Users/shane/src/edk2 EDK_TOOLS_PATH: /Users/shane/src/edk2/BaseTools CONF_PATH: /Users/shane/src/edk2/Conf ================================================================================ Building AptioFixPkg <-------------------------------------------------- Build environment: Darwin-18.5.0-x86_64-i386-64bit Build start time: 22:39:54, Feb.28 2019 WORKSPACE = /Users/shane/src/edk2 EDK_TOOLS_PATH = /Users/shane/src/edk2/BaseTools CONF_PATH = /Users/shane/src/edk2/Conf Architecture(s) = X64 Build target = RELEASE Toolchain = XCODE8 Active Platform = /Users/shane/src/edk2/AptioFixPkg/AptioFixPkg.dsc Processing meta-data . done! Building ... /Users/shane/src/edk2/MdePkg/Library/UefiUsbLib/UefiUsbLib.inf [X64] Building ... /Users/shane/src/edk2/MdePkg/Library/UefiDriverEntryPoint/UefiDriverEntryPoint.inf [X64] make: Nothing to be done for `tbuild'. make: Nothing to be done for `tbuild'. Building ... /Users/shane/src/edk2/MdeModulePkg/Library/UefiHiiLib/UefiHiiLib.inf [X64] Building ... /Users/shane/src/edk2/MdePkg/Library/UefiLib/UefiLib.inf [X64] make: Nothing to be done for `tbuild'. Building ... /Users/shane/src/edk2/MdeModulePkg/Library/UefiHiiServicesLib/UefiHiiServicesLib.inf [X64] make: Nothing to be done for `tbuild'. Building ... /Users/shane/src/edk2/MdePkg/Library/UefiRuntimeServicesTableLib/UefiRuntimeServicesTableLib.inf [X64] make: Nothing to be done for `tbuild'. Building ... /Users/shane/src/edk2/MdePkg/Library/UefiDevicePathLib/UefiDevicePathLib.inf [X64] make: Nothing to be done for `tbuild'. make: Nothing to be done for `tbuild'. Building ... /Users/shane/src/edk2/MdePkg/Library/UefiMemoryAllocationLib/UefiMemoryAllocationLib.inf [X64] Building ... /Users/shane/src/edk2/MdePkg/Library/BasePrintLib/BasePrintLib.inf [X64] make: Nothing to be done for `tbuild'. Building ... /Users/shane/src/edk2/MdePkg/Library/UefiBootServicesTableLib/UefiBootServicesTableLib.inf [X64] make: Nothing to be done for `tbuild'. make: Nothing to be done for `tbuild'. Building ... /Users/shane/src/edk2/MdePkg/Library/BaseMemoryLib/BaseMemoryLib.inf [X64] Building ... /Users/shane/src/edk2/OcSupportPkg/Library/OcDebugLogLib/OcDebugLogLib.inf [X64] make: Nothing to be done for `tbuild'. Building ... /Users/shane/src/edk2/MdePkg/Library/BasePcdLibNull/BasePcdLibNull.inf [X64] make: Nothing to be done for `tbuild'. make: Nothing to be done for `tbuild'. Building ... /Users/shane/src/edk2/MdePkg/Library/BaseLib/BaseLib.inf [X64] Building ... /Users/shane/src/edk2/MdePkg/Library/BaseDebugPrintErrorLevelLib/BaseDebugPrintErrorLevelLib.inf [X64] make: Nothing to be done for `tbuild'. make: Nothing to be done for `tbuild'. Building ... /Users/shane/src/edk2/MdePkg/Library/BaseIoLibIntrinsic/BaseIoLibIntrinsic.inf [X64] Building ... /Users/shane/src/edk2/MdePkg/Library/UefiApplicationEntryPoint/UefiApplicationEntryPoint.inf [X64] make: Nothing to be done for `tbuild'. Building ... /Users/shane/src/edk2/MdePkg/Library/BaseCpuLib/BaseCpuLib.inf [X64] make: Nothing to be done for `tbuild'. Building ... /Users/shane/src/edk2/MdePkg/Library/BaseRngLib/BaseRngLib.inf [X64] make: Nothing to be done for `tbuild'. make: Nothing to be done for `tbuild'. Building ... /Users/shane/src/edk2/AptioFixPkg/Platform/AptioInputFix/AptioInputFix.inf [X64] Building ... /Users/shane/src/edk2/AptioFixPkg/Application/CleanNvram/CleanNvram.inf [X64] make: Nothing to be done for `tbuild'. Building ... /Users/shane/src/edk2/AptioFixPkg/Application/VerifyMsrE2/VerifyMsrE2.inf [X64] make: Nothing to be done for `tbuild'. Building ... /Users/shane/src/edk2/AptioFixPkg/Platform/AptioMemoryFix/AptioMemoryFix.inf [X64] make: Nothing to be done for `tbuild'. make: Nothing to be done for `tbuild'. - Done - Build end time: 22:39:56, Feb.28 2019 Build total time: 00:00:02 ================================================================================ Building AppleSupportPkg <-------------------------------------------------- Build environment: Darwin-18.5.0-x86_64-i386-64bit Build start time: 22:39:56, Feb.28 2019 WORKSPACE = /Users/shane/src/edk2 EDK_TOOLS_PATH = /Users/shane/src/edk2/BaseTools CONF_PATH = /Users/shane/src/edk2/Conf Architecture(s) = X64 Build target = RELEASE Toolchain = XCODE8 Active Platform = /Users/shane/src/edk2/AppleSupportPkg/AppleSupportPkg.dsc Processing meta-data . done! Building ... /Users/shane/src/edk2/MdePkg/Library/UefiDriverEntryPoint/UefiDriverEntryPoint.inf [X64] Building ... /Users/shane/src/edk2/MdePkg/Library/BasePeCoffGetEntryPointLib/BasePeCoffGetEntryPointLib.inf [X64] make: Nothing to be done for `tbuild'. make: Nothing to be done for `tbuild'. Building ... /Users/shane/src/edk2/MdePkg/Library/BasePeCoffLib/BasePeCoffLib.inf [X64] make: Nothing to be done for `tbuild'. Building ... /Users/shane/src/edk2/MdePkg/Library/BaseCacheMaintenanceLib/BaseCacheMaintenanceLib.inf [X64] make: Nothing to be done for `tbuild'. Building ... /Users/shane/src/edk2/MdePkg/Library/DxeServicesLib/DxeServicesLib.inf [X64] Building ... /Users/shane/src/edk2/OcSupportPkg/Library/OcAppleImageVerificationLib/OcAppleImageVerificationLib.inf [X64] make: Nothing to be done for `tbuild'. Building ... /Users/shane/src/edk2/MdePkg/Library/BasePeCoffExtraActionLibNull/BasePeCoffExtraActionLibNull.inf [X64] make: Nothing to be done for `tbuild'. make: Nothing to be done for `tbuild'. Building ... /Users/shane/src/edk2/MdePkg/Library/DxeHobLib/DxeHobLib.inf [X64] Building ... /Users/shane/src/edk2/OcSupportPkg/Library/OcGuardLib/OcGuardLib.inf [X64] make: Nothing to be done for `tbuild'. Building ... /Users/shane/src/edk2/OcSupportPkg/Library/OcCryptoLib/OcCryptoLib.inf [X64] make: Nothing to be done for `tbuild'. Building ... /Users/shane/src/edk2/MdePkg/Library/UefiLib/UefiLib.inf [X64] make: Nothing to be done for `tbuild'. Building ... /Users/shane/src/edk2/MdePkg/Library/UefiDevicePathLib/UefiDevicePathLib.inf [X64] make: Nothing to be done for `tbuild'. Building ... /Users/shane/src/edk2/MdePkg/Library/UefiRuntimeServicesTableLib/UefiRuntimeServicesTableLib.inf [X64] make: Nothing to be done for `tbuild'. Building ... /Users/shane/src/edk2/MdePkg/Library/UefiMemoryAllocationLib/UefiMemoryAllocationLib.inf [X64] make: Nothing to be done for `tbuild'. Building ... /Users/shane/src/edk2/MdePkg/Library/BasePrintLib/BasePrintLib.inf [X64] make: Nothing to be done for `tbuild'. Building ... /Users/shane/src/edk2/MdePkg/Library/UefiBootServicesTableLib/UefiBootServicesTableLib.inf [X64] make: Nothing to be done for `tbuild'. Building ... /Users/shane/src/edk2/MdePkg/Library/BaseLib/BaseLib.inf [X64] make: Nothing to be done for `tbuild'. Building ... /Users/shane/src/edk2/OcSupportPkg/Library/OcDebugLogLib/OcDebugLogLib.inf [X64] Building ... /Users/shane/src/edk2/MdePkg/Library/BaseMemoryLib/BaseMemoryLib.inf [X64] make: Nothing to be done for `tbuild'. make: Nothing to be done for `tbuild'. Building ... /Users/shane/src/edk2/MdePkg/Library/BasePcdLibNull/BasePcdLibNull.inf [X64] make: Nothing to be done for `tbuild'. Building ... /Users/shane/src/edk2/MdePkg/Library/BaseDebugPrintErrorLevelLib/BaseDebugPrintErrorLevelLib.inf [X64] make: Nothing to be done for `tbuild'. make: Nothing to be done for `tbuild'. Building ... /Users/shane/src/edk2/MdeModulePkg/Library/UefiHiiLib/UefiHiiLib.inf [X64] Building ... /Users/shane/src/edk2/MdePkg/Library/UefiUsbLib/UefiUsbLib.inf [X64] make: Nothing to be done for `tbuild'. Building ... /Users/shane/src/edk2/MdePkg/Library/BaseReportStatusCodeLibNull/BaseReportStatusCodeLibNull.inf [X64] make: Nothing to be done for `tbuild'. Building ... /Users/shane/src/edk2/MdeModulePkg/Library/UefiHiiServicesLib/UefiHiiServicesLib.inf [X64] make: Nothing to be done for `tbuild'. Building ... /Users/shane/src/edk2/OcSupportPkg/Library/OcMiscLib/OcMiscLib.inf [X64] make: Nothing to be done for `tbuild'. Building ... /Users/shane/src/edk2/OcSupportPkg/Library/OcTimerLib/OcTimerLib.inf [X64] Building ... /Users/shane/src/edk2/AppleSupportPkg/Library/AppleEventLib/AppleEventLib.inf [X64] make: Nothing to be done for `tbuild'. make: Nothing to be done for `tbuild'. Building ... /Users/shane/src/edk2/OcSupportPkg/Library/OcPngLib/OcPngLib.inf [X64] make: Nothing to be done for `tbuild'. Building ... /Users/shane/src/edk2/MdePkg/Library/BasePciLibCf8/BasePciLibCf8.inf [X64] make: Nothing to be done for `tbuild'. make: Nothing to be done for `tbuild'. Building ... /Users/shane/src/edk2/MdePkg/Library/BasePciCf8Lib/BasePciCf8Lib.inf [X64] make: Nothing to be done for `tbuild'. Building ... /Users/shane/src/edk2/MdePkg/Library/BaseIoLibIntrinsic/BaseIoLibIntrinsic.inf [X64] Building ... /Users/shane/src/edk2/AppleSupportPkg/Platform/AppleImageLoader/AppleImageLoader.inf [X64] make: Nothing to be done for `tbuild'. Building ... /Users/shane/src/edk2/AppleSupportPkg/Platform/AppleUsbKbDxe/UsbKbDxe.inf [X64] make: Nothing to be done for `tbuild'. Building ... /Users/shane/src/edk2/AppleSupportPkg/Platform/ApfsDriverLoader/ApfsDriverLoader.inf [X64] Building ... /Users/shane/src/edk2/AppleSupportPkg/Platform/AppleUiSupport/AppleUiSupport.inf [X64] make: Nothing to be done for `tbuild'. make: Nothing to be done for `tbuild'. make: Nothing to be done for `tbuild'. - Done - Build end time: 22:39:59, Feb.28 2019 Build total time: 00:00:03 ================================================================================ Building Clover <-------------------------------------------------- ================================================================================ boot6 <-------------------------------------------------- TOOLCHAIN_DIR: /Users/shane/src/opt/local MTOC_PREFIX: /usr/local/bin/ NASM_PREFIX: /Users/shane/src/opt/local/bin/ NASM_VER: 2.13.03 Building from: /Users/shane/src/edk2 Running edk2 build for CloverX64 using the command: build -D NO_GRUB_DRIVERS_EMBEDDED --conf=/Users/shane/src/edk2/Conf -D USE_LOW_EBDA -p Clover/Clover.dsc -a X64 -b RELEASE -t XCODE8 -n 5 Build environment: Darwin-18.5.0-x86_64-i386-64bit Build start time: 22:40:00, Feb.28 2019 WORKSPACE = /Users/shane/src/edk2 EDK_TOOLS_PATH = /Users/shane/src/edk2/BaseTools CONF_PATH = /Users/shane/src/edk2/Conf Architecture(s) = X64 Build target = RELEASE Toolchain = XCODE8 Active Platform = /Users/shane/src/edk2/Clover/Clover.dsc Flash Image Definition = /Users/shane/src/edk2/Clover/Clover.fdf Processing meta-data ..... done! Building ... /Users/shane/src/edk2/MdePkg/Library/BaseIoLibIntrinsic/BaseIoLibIntrinsic.inf [X64] Building ... /Users/shane/src/edk2/MdePkg/Library/BaseReportStatusCodeLibNull/BaseReportStatusCodeLibNull.inf [X64] Building ... /Users/shane/src/edk2/MdePkg/Library/BasePrintLib/BasePrintLib.inf [X64] make: Nothing to be done for `tbuild'. make: Nothing to be done for `tbuild'. Building ... /Users/shane/src/edk2/MdePkg/Library/BaseLib/BaseLib.inf [X64] make: Nothing to be done for `tbuild'. Building ... /Users/shane/src/edk2/MdePkg/Library/BaseMemoryLib/BaseMemoryLib.inf [X64] Building ... /Users/shane/src/edk2/MdePkg/Library/BaseDebugLibNull/BaseDebugLibNull.inf [X64] Building ... /Users/shane/src/edk2/MdePkg/Library/BasePcdLibNull/BasePcdLibNull.inf [X64] make: Nothing to be done for `tbuild'. make: Nothing to be done for `tbuild'. make: Nothing to be done for `tbuild'. make: Nothing to be done for `tbuild'. Building ... /Users/shane/src/edk2/MdePkg/Library/BaseCpuLib/BaseCpuLib.inf [X64] Building ... /Users/shane/src/edk2/Clover/Library/WaveLib/WaveLib.inf [X64] make: Nothing to be done for `tbuild'. Building ... /Users/shane/src/edk2/Clover/Library/OpensslLib/OpensslLibNull.inf [X64] make: Nothing to be done for `tbuild'. Building ... /Users/shane/src/edk2/MdePkg/Library/UefiMemoryLib/UefiMemoryLib.inf [X64] make: Nothing to be done for `tbuild'. Building ... /Users/shane/src/edk2/Clover/ShellPkg/Library/UefiShellDebug1CommandsLib/UefiShellDebug1CommandsLib.inf [X64] make: Nothing to be done for `tbuild'. Building ... /Users/shane/src/edk2/Clover/ShellPkg/Library/UefiShellInstall1CommandsLib/UefiShellInstall1CommandsLib.inf [X64] Building ... /Users/shane/src/edk2/Clover/ShellPkg/Library/UefiShellDriver1CommandsLib/UefiShellDriver1CommandsLib.inf [X64] make: Nothing to be done for `tbuild'. Building ... /Users/shane/src/edk2/Clover/ShellPkg/Library/UefiShellLevel3CommandsLib/UefiShellLevel3CommandsLib.inf [X64] Building ... /Users/shane/src/edk2/Clover/ShellPkg/Library/UefiShellLevel1CommandsLib/UefiShellLevel1CommandsLib.inf [X64] make: Nothing to be done for `tbuild'. make: Nothing to be done for `tbuild'. make: Nothing to be done for `tbuild'. Building ... /Users/shane/src/edk2/Clover/ShellPkg/Library/UefiShellLevel2CommandsLib/UefiShellLevel2CommandsLib.inf [X64] Building ... /Users/shane/src/edk2/MdeModulePkg/Library/DxeNetLib/DxeNetLib.inf [X64] make: Nothing to be done for `tbuild'. Building ... /Users/shane/src/edk2/Clover/ShellPkg/Library/UefiShellBcfgCommandLib/UefiShellBcfgCommandLib.inf [X64] make: Nothing to be done for `tbuild'. make: Nothing to be done for `tbuild'. Building ... /Users/shane/src/edk2/Clover/ShellPkg/Library/UefiShellCommandLib/UefiShellCommandLib.inf [X64] Building ... /Users/shane/src/edk2/Clover/ShellPkg/Library/UefiHandleParsingLib/UefiHandleParsingLib.inf [X64] make: Nothing to be done for `tbuild'. make: Nothing to be done for `tbuild'. Building ... /Users/shane/src/edk2/MdeModulePkg/Library/UefiHiiServicesLib/UefiHiiServicesLib.inf [X64] Building ... /Users/shane/src/edk2/Clover/ShellPkg/Library/UefiShellNetwork2CommandsLib/UefiShellNetwork2CommandsLib.inf [X64] make: Nothing to be done for `tbuild'. make: Nothing to be done for `tbuild'. Building ... /Users/shane/src/edk2/Clover/ShellPkg/Library/UefiShellNetwork1CommandsLib/UefiShellNetwork1CommandsLib.inf [X64] Building ... /Users/shane/src/edk2/Clover/ShellPkg/Library/UefiShellLib/UefiShellLib.inf [X64] make: Nothing to be done for `tbuild'. Building ... /Users/shane/src/edk2/MdePkg/Library/UefiApplicationEntryPoint/UefiApplicationEntryPoint.inf [X64] make: Nothing to be done for `tbuild'. make: Nothing to be done for `tbuild'. Building ... /Users/shane/src/edk2/MdePkg/Library/UefiFileHandleLib/UefiFileHandleLib.inf [X64] make: Nothing to be done for `tbuild'. Building ... /Users/shane/src/edk2/MdePkg/Library/UefiUsbLib/UefiUsbLib.inf [X64] make: Nothing to be done for `tbuild'. Building ... /Users/shane/src/edk2/MdePkg/Library/UefiScsiLib/UefiScsiLib.inf [X64] make: Nothing to be done for `tbuild'. Building ... /Users/shane/src/edk2/Clover/Library/VideoBiosPatchLib/VideoBiosPatchLib.inf [X64] make: Nothing to be done for `tbuild'. Building ... /Users/shane/src/edk2/Clover/Library/MemLogLibDefault/MemLogLibDefault.inf [X64] make: Nothing to be done for `tbuild'. Building ... /Users/shane/src/edk2/MdePkg/Library/BasePciLibCf8/BasePciLibCf8.inf [X64] make: Nothing to be done for `tbuild'. Building ... /Users/shane/src/edk2/MdePkg/Library/BasePciCf8Lib/BasePciCf8Lib.inf [X64] make: Nothing to be done for `tbuild'. Building ... /Users/shane/src/edk2/Clover/Library/OsxBdsPlatformLib/PlatformBds.inf [X64] make: Nothing to be done for `tbuild'. Building ... /Users/shane/src/edk2/Clover/Library/GenericBdsLib/GenericBdsLib.inf [X64] make: Nothing to be done for `tbuild'. Building ... /Users/shane/src/edk2/Clover/Library/LzmaCustomDecompressLib/LzmaCustomDecompressLib.inf [X64] make: Nothing to be done for `tbuild'. Building ... /Users/shane/src/edk2/MdeModulePkg/Library/CustomizedDisplayLib/CustomizedDisplayLib.inf [X64] make: Nothing to be done for `tbuild'. Building ... /Users/shane/src/edk2/MdePkg/Library/DxePcdLib/DxePcdLib.inf [X64] make: Nothing to be done for `tbuild'. Building ... /Users/shane/src/edk2/MdeModulePkg/Library/UefiBootManagerLib/UefiBootManagerLib.inf [X64] make: Nothing to be done for `tbuild'. Building ... /Users/shane/src/edk2/MdeModulePkg/Library/UefiHiiLib/UefiHiiLib.inf [X64] make: Nothing to be done for `tbuild'. Building ... /Users/shane/src/edk2/MdeModulePkg/Library/UefiSortLib/UefiSortLib.inf [X64] make: Nothing to be done for `tbuild'. Building ... /Users/shane/src/edk2/Clover/Library/UefiHiiServicesLib/UefiHiiServicesLib.inf [X64] make: Nothing to be done for `tbuild'. Building ... /Users/shane/src/edk2/MdeModulePkg/Library/DxeSecurityManagementLib/DxeSecurityManagementLib.inf [X64] make: Nothing to be done for `tbuild'. Building ... /Users/shane/src/edk2/MdeModulePkg/Library/DxeCapsuleLibNull/DxeCapsuleLibNull.inf [X64] make: Nothing to be done for `tbuild'. Building ... /Users/shane/src/edk2/MdeModulePkg/Library/VarCheckLib/VarCheckLib.inf [X64] make: Nothing to be done for `tbuild'. Building ... /Users/shane/src/edk2/MdeModulePkg/Library/AuthVariableLibNull/AuthVariableLibNull.inf [X64] make: Nothing to be done for `tbuild'. Building ... /Users/shane/src/edk2/MdeModulePkg/Library/TpmMeasurementLibNull/TpmMeasurementLibNull.inf [X64] make: Nothing to be done for `tbuild'. Building ... /Users/shane/src/edk2/MdePkg/Library/DxeServicesTableLib/DxeServicesTableLib.inf [X64] make: Nothing to be done for `tbuild'. Building ... /Users/shane/src/edk2/MdePkg/Library/BaseSynchronizationLib/BaseSynchronizationLib.inf [X64] make: Nothing to be done for `tbuild'. Building ... /Users/shane/src/edk2/MdePkg/Library/UefiRuntimeLib/UefiRuntimeLib.inf [X64] make: Nothing to be done for `tbuild'. Building ... /Users/shane/src/edk2/MdePkg/Library/UefiDriverEntryPoint/UefiDriverEntryPoint.inf [X64] make: Nothing to be done for `tbuild'. Building ... /Users/shane/src/edk2/MdePkg/Library/DxeHobLib/DxeHobLib.inf [X64] make: Nothing to be done for `tbuild'. Building ... /Users/shane/src/edk2/MdePkg/Library/UefiMemoryAllocationLib/UefiMemoryAllocationLib.inf [X64] make: Nothing to be done for `tbuild'. Building ... /Users/shane/src/edk2/MdeModulePkg/Library/CpuExceptionHandlerLibNull/CpuExceptionHandlerLibNull.inf [X64] make: Nothing to be done for `tbuild'. Building ... /Users/shane/src/edk2/MdeModulePkg/Library/DebugAgentLibNull/DebugAgentLibNull.inf [X64] Building ... /Users/shane/src/edk2/MdePkg/Library/DxeServicesLib/DxeServicesLib.inf [X64] make: Nothing to be done for `tbuild'. make: Nothing to be done for `tbuild'. Building ... /Users/shane/src/edk2/Clover/Library/DuetTimerLib/DuetTimerLib.inf [X64] make: Nothing to be done for `tbuild'. Building ... /Users/shane/src/edk2/MdePkg/Library/DxeExtractGuidedSectionLib/DxeExtractGuidedSectionLib.inf [X64] make: Nothing to be done for `tbuild'. Building ... /Users/shane/src/edk2/MdePkg/Library/BasePeCoffGetEntryPointLib/BasePeCoffGetEntryPointLib.inf [X64] make: Nothing to be done for `tbuild'. Building ... /Users/shane/src/edk2/Clover/Library/VBoxPeCoffLib/VBoxPeCoffLib.inf [X64] make: Nothing to be done for `tbuild'. Building ... /Users/shane/src/edk2/MdePkg/Library/BasePerformanceLibNull/BasePerformanceLibNull.inf [X64] make: Nothing to be done for `tbuild'. Building ... /Users/shane/src/edk2/MdePkg/Library/BaseUefiDecompressLib/BaseUefiDecompressLib.inf [X64] make: Nothing to be done for `tbuild'. Building ... /Users/shane/src/edk2/MdePkg/Library/BaseCacheMaintenanceLib/BaseCacheMaintenanceLib.inf [X64] make: Nothing to be done for `tbuild'. Building ... /Users/shane/src/edk2/MdePkg/Library/UefiLib/UefiLib.inf [X64] make: Nothing to be done for `tbuild'. Building ... /Users/shane/src/edk2/MdePkg/Library/DxeCoreHobLib/DxeCoreHobLib.inf [X64] make: Nothing to be done for `tbuild'. Building ... /Users/shane/src/edk2/MdePkg/Library/BasePeCoffExtraActionLibNull/BasePeCoffExtraActionLibNull.inf [X64] make: Nothing to be done for `tbuild'. Building ... /Users/shane/src/edk2/MdePkg/Library/UefiBootServicesTableLib/UefiBootServicesTableLib.inf [X64] make: Nothing to be done for `tbuild'. Building ... /Users/shane/src/edk2/MdePkg/Library/UefiDevicePathLib/UefiDevicePathLib.inf [X64] make: Nothing to be done for `tbuild'. Building ... /Users/shane/src/edk2/MdePkg/Library/UefiRuntimeServicesTableLib/UefiRuntimeServicesTableLib.inf [X64] make: Nothing to be done for `tbuild'. Building ... /Users/shane/src/edk2/MdePkg/Library/DxeCoreEntryPoint/DxeCoreEntryPoint.inf [X64] make: Nothing to be done for `tbuild'. Building ... /Users/shane/src/edk2/MdeModulePkg/Library/DxeCoreMemoryAllocationLib/DxeCoreMemoryAllocationLib.inf [X64] make: Nothing to be done for `tbuild'. Building ... /Users/shane/src/edk2/Clover/CloverEFI/OsxDxeIpl/DxeIpl.inf [X64] make: Nothing to be done for `tbuild'. Building ... /Users/shane/src/edk2/Clover/OsxLowMemFixDrv/OsxLowMemFixDrv.inf [X64] make: Nothing to be done for `tbuild'. Building ... /Users/shane/src/edk2/Clover/OsxAptioFixDrv/OsxAptioFix3Drv.inf [X64] Building ... /Users/shane/src/edk2/Clover/OsxAptioFixDrv/OsxAptioFixDrv.inf [X64] Building ... /Users/shane/src/edk2/Clover/rEFIt_UEFI/refit.inf [X64] Building ... /Users/shane/src/edk2/Clover/ShellPkg/Application/Shell/Shell.inf [X64] make: Nothing to be done for `tbuild'. Building ... /Users/shane/src/edk2/Clover/bdmesg_efi/bdmesg.inf [X64] [CC] OsxLowMemFixDrv make: Nothing to be done for `tbuild'. Building ... /Users/shane/src/edk2/Clover/Drivers/AudioDxe/AudioDxe.inf [X64] [SLINK] OsxLowMemFixDrv [DLINK1] OsxLowMemFixDrv [MTOC] OsxLowMemFixDrv [GENFW] OsxLowMemFixDrv Building ... /Users/shane/src/edk2/Clover/Protocols/EmuVariableUefi/EmuVariableRuntimeDxe.inf [X64] [CC] OsxAptioFix3Drv /Users/shane/src/edk2/Clover/Drivers/AudioDxe/HdaCodec/HdaCodec.c:243:37: error: expected expression HdaWidget->DefaultEapd &? = 0x7; [SLINK] OsxAptioFix3Drv ^ /Users/shane/src/edk2/Clover/Drivers/AudioDxe/HdaCodec/HdaCodec.c:243:39: error: expected expression HdaWidget->DefaultEapd &? = 0x7; ^ /Users/shane/src/edk2/Clover/Drivers/AudioDxe/HdaCodec/HdaCodec.c:243:44: error: expected ':' HdaWidget->DefaultEapd &? = 0x7; make: Nothing to be done for `tbuild'. Building ... /Users/shane/src/edk2/Clover/Protocols/OsxFatBinaryDrv/OsxFatBinaryDrv.inf [X64] ^ : /Users/shane/src/edk2/Clover/Drivers/AudioDxe/HdaCodec/HdaCodec.c:243:37: note: to match this '?' HdaWidget->DefaultEapd &? = 0x7; ^ /Users/shane/src/edk2/Clover/Drivers/AudioDxe/HdaCodec/HdaCodec.c:243:44: error: expected expression HdaWidget->DefaultEapd &? = 0x7; ^ [DLINK1] OsxAptioFix3Drv [MTOC] OsxAptioFix3Drv 4 errors generated. make: *** [/Users/shane/src/edk2/Build/Clover/RELEASE_XCODE8/X64/Clover/Drivers/AudioDxe/AudioDxe/OUTPUT/HdaCodec/HdaCodec.obj] Error 1 build.py... : error 7000: Failed to execute command make tbuild [/Users/shane/src/edk2/Build/Clover/RELEASE_XCODE8/X64/Clover/Drivers/AudioDxe/AudioDxe] build.py... : error F002: Failed to build module /Users/shane/src/edk2/Clover/Drivers/AudioDxe/AudioDxe.inf [X64, XCODE8, RELEASE] - Failed - Build end time: 22:40:10, Feb.28 2019 Build total time: 00:00:10 o_Ops, ./ebuild.sh exited with error(s), aborting..
  10. SavageAUS

    [pre-release] macOS Mojave 10.14.4

    Up until today i have not had any issues updating my desktop machine but todays beta update will download, ask me to restart, it states it is installing but when it reboots back to clover GUI i see no "boot macOS from...." install drive.
  11. SavageAUS

    Shutdown kernel panic and sleep/wake issues

    Remove fakesmc sensors and try. Sent from my iPhone using Tapatalk Remove fakesmc sensors and try. Sent from my iPhone using Tapatalk
  12. SavageAUS

    Hackintool v2.5.3

    As far as I’m aware FakePCIID.kext does nothing on it’s own. Sent from my iPhone using Tapatalk
  13. SavageAUS

    Hackintool v2.5.3

    When mine was empty I had no internet access, once internet was restored so we’re the tabs. Sent from my iPhone using Tapatalk When mine was empty I had no internet access, once internet was restored so we’re the tabs. Sent from my iPhone using Tapatalk
  14. Does anyone have any issues with cpu power management in Mojave? Sent from my iPhone using Tapatalk
  15. Just make sure you update kexts and clover and should be good to go. It’s Mojave that doesn’t have nvidia drivers yet. Sent from my iPhone using Tapatalk
×